[Bug 227427] devel/boost-all: Update to 1.67.0

classic Classic list List threaded Threaded
52 messages Options
123
Reply | Threaded
Open this post in threaded view
|

[Bug 227427] devel/boost-all: Update to 1.67.0

bugzilla-noreply
https://bugs.freebsd.org/bugzilla/show_bug.cgi?id=227427

--- Comment #14 from [hidden email] ---
A commit references this bug:

Author: jbeich
Date: Tue Apr 17 09:33:39 UTC 2018
New revision: 467588
URL: https://svnweb.freebsd.org/changeset/ports/467588

Log:
  dns/dnsdist: unbreak with boost 1.67

  In file included from dnsdist.cc:44:
  In file included from ./dnsdist.hh:46:
  In file included from /usr/local/include/boost/uuid/uuid_generators.hpp:17:
  In file included from /usr/local/include/boost/uuid/random_generator.hpp:19:
  In file included from
/usr/local/include/boost/tti/has_member_function.hpp:15:
  In file included from /usr/local/include/boost/tti/detail/dmem_fun.hpp:11:
  In file included from
/usr/local/include/boost/function_types/is_member_function_pointer.hpp:14:
  In file included from
/usr/local/include/boost/function_types/components.hpp:61:
  /usr/local/include/boost/function_types/detail/class_transform.hpp:26:31:
error: expected a qualified name after 'typename'
  template<typename T, typename L>
                                ^
  ./dns.hh:238:11: note: expanded from macro 'L'
   #define L theL()
             ^

  PR:           227427
  Reported by:  antoine (via exp-run)
  Obtained from:        upstream

Changes:
  head/dns/dnsdist/files/patch-boost-1.67

--
You are receiving this mail because:
You are on the CC list for the bug.
_______________________________________________
[hidden email] mailing list
https://lists.freebsd.org/mailman/listinfo/freebsd-office
To unsubscribe, send any mail to "[hidden email]"
Reply | Threaded
Open this post in threaded view
|

[Bug 227427] devel/boost-all: Update to 1.67.0

bugzilla-noreply
In reply to this post by bugzilla-noreply
https://bugs.freebsd.org/bugzilla/show_bug.cgi?id=227427

--- Comment #15 from Antoine Brodin <[hidden email]> ---
New failures on 11.1 amd64:

+ {"origin"=>"cad/freecad", "phase"=>"build", "errortype"=>"linker_error"}
+ {"origin"=>"comms/gnuradio", "phase"=>"build", "errortype"=>"???"}
+ {"origin"=>"databases/mongodb34", "phase"=>"build", "errortype"=>"clang"}
+ {"origin"=>"databases/mongodb36", "phase"=>"build", "errortype"=>"clang"}
+ {"origin"=>"devel/RStudio", "phase"=>"build", "errortype"=>"???"}
+ {"origin"=>"devel/mongo-cxx-driver", "phase"=>"build", "errortype"=>"clang"}
+ {"origin"=>"devel/uatraits", "phase"=>"configure",
"errortype"=>"configure_error"}
+ {"origin"=>"dns/dnsdist", "phase"=>"build", "errortype"=>"bad_C++_code"}
+ {"origin"=>"dns/powerdns-recursor", "phase"=>"build",
"errortype"=>"bad_C++_code"}
+ {"origin"=>"dns/powerdns-recursor40", "phase"=>"build",
"errortype"=>"bad_C++_code"}
+ {"origin"=>"editors/openoffice-4", "phase"=>"build", "errortype"=>"clang"}
+ {"origin"=>"editors/openoffice-devel", "phase"=>"build",
"errortype"=>"clang"}
+ {"origin"=>"games/opendungeons", "phase"=>"build",
"errortype"=>"linker_error"}
+ {"origin"=>"games/vegastrike", "phase"=>"build", "errortype"=>"linker_error"}
+ {"origin"=>"graphics/aqsis", "phase"=>"build", "errortype"=>"linker_error"}
+ {"origin"=>"graphics/caffe", "phase"=>"build", "errortype"=>"linker_error"}
+ {"origin"=>"graphics/gsculpt", "phase"=>"build", "errortype"=>"linker_error"}
+ {"origin"=>"graphics/pcl-pointclouds", "phase"=>"build",
"errortype"=>"clang"}
+ {"origin"=>"graphics/py-openimageio", "phase"=>"stage",
"errortype"=>"install_error"}
+ {"origin"=>"net-p2p/monero-cli", "phase"=>"build", "errortype"=>"???"}
+ {"origin"=>"net/ceph", "phase"=>"build", "errortype"=>"???"}
+ {"origin"=>"sysutils/condor", "phase"=>"build", "errortype"=>"bad_C++_code"}
+ {"origin"=>"sysutils/usbtop", "phase"=>"build", "errortype"=>"linker_error"}

--
You are receiving this mail because:
You are on the CC list for the bug.
_______________________________________________
[hidden email] mailing list
https://lists.freebsd.org/mailman/listinfo/freebsd-office
To unsubscribe, send any mail to "[hidden email]"
Reply | Threaded
Open this post in threaded view
|

[Bug 227427] devel/boost-all: Update to 1.67.0

bugzilla-noreply
In reply to this post by bugzilla-noreply
https://bugs.freebsd.org/bugzilla/show_bug.cgi?id=227427

--- Comment #16 from Antoine Brodin <[hidden email]> ---
11.1 amd64 results at
http://package22.nyi.freebsd.org/build.html?mastername=111amd64-default-PR227427&build=2018-04-17_05h28m08s

--
You are receiving this mail because:
You are on the CC list for the bug.
_______________________________________________
[hidden email] mailing list
https://lists.freebsd.org/mailman/listinfo/freebsd-office
To unsubscribe, send any mail to "[hidden email]"
Reply | Threaded
Open this post in threaded view
|

[Bug 227427] devel/boost-all: Update to 1.67.0

bugzilla-noreply
In reply to this post by bugzilla-noreply
https://bugs.freebsd.org/bugzilla/show_bug.cgi?id=227427

--- Comment #17 from Antoine Brodin <[hidden email]> ---
Exp-run results on 10.3 i386;

http://package23.nyi.freebsd.org/build.html?mastername=103i386-default-PR227427&build=2018-04-17_05h28m01s

New failures on 10.3 i386:

+ {"origin"=>"comms/gnuradio", "phase"=>"build", "errortype"=>"bad_C++_code"}
+ {"origin"=>"devel/RStudio", "phase"=>"build", "errortype"=>"bad_C++_code"}
+ {"origin"=>"devel/mongo-cxx-driver", "phase"=>"build",
"errortype"=>"bad_C++_code"}
+ {"origin"=>"devel/uatraits", "phase"=>"configure",
"errortype"=>"configure_error"}
+ {"origin"=>"dns/powerdns-recursor40", "phase"=>"build",
"errortype"=>"bad_C++_code"}
+ {"origin"=>"editors/openoffice-4", "phase"=>"build",
"errortype"=>"bad_C++_code"}
+ {"origin"=>"editors/openoffice-devel", "phase"=>"build",
"errortype"=>"bad_C++_code"}
+ {"origin"=>"games/opendungeons", "phase"=>"build",
"errortype"=>"bad_C++_code"}
+ {"origin"=>"games/vegastrike", "phase"=>"build", "errortype"=>"bad_C++_code"}
+ {"origin"=>"graphics/aqsis", "phase"=>"build", "errortype"=>"bad_C++_code"}
+ {"origin"=>"graphics/caffe", "phase"=>"build", "errortype"=>"bad_C++_code"}
+ {"origin"=>"graphics/gsculpt", "phase"=>"build", "errortype"=>"bad_C++_code"}
+ {"origin"=>"graphics/pcl-pointclouds", "phase"=>"build",
"errortype"=>"bad_C++_code"}
+ {"origin"=>"graphics/py-openimageio", "phase"=>"stage",
"errortype"=>"bad_C++_code"}
+ {"origin"=>"net-p2p/monero-cli", "phase"=>"build",
"errortype"=>"bad_C++_code"}
+ {"origin"=>"sysutils/condor", "phase"=>"build", "errortype"=>"bad_C++_code"}
+ {"origin"=>"sysutils/usbtop", "phase"=>"build", "errortype"=>"bad_C++_code"}

--
You are receiving this mail because:
You are on the CC list for the bug.
_______________________________________________
[hidden email] mailing list
https://lists.freebsd.org/mailman/listinfo/freebsd-office
To unsubscribe, send any mail to "[hidden email]"
Reply | Threaded
Open this post in threaded view
|

[Bug 227427] devel/boost-all: Update to 1.67.0

bugzilla-noreply
In reply to this post by bugzilla-noreply
https://bugs.freebsd.org/bugzilla/show_bug.cgi?id=227427

--- Comment #18 from Antoine Brodin <[hidden email]> ---
Exp-run results on 10.3 amd64:

http://package22.nyi.freebsd.org/build.html?mastername=103amd64-default-PR227427&build=2018-04-17_15h33m37s


New failures on 10.3 amd64:

+ {"origin"=>"comms/gnuradio", "phase"=>"build", "errortype"=>"bad_C++_code"}
+ {"origin"=>"databases/mongodb34", "phase"=>"build",
"errortype"=>"bad_C++_code"}
+ {"origin"=>"devel/RStudio", "phase"=>"build", "errortype"=>"bad_C++_code"}
+ {"origin"=>"devel/mongo-cxx-driver", "phase"=>"build",
"errortype"=>"bad_C++_code"}
+ {"origin"=>"devel/uatraits", "phase"=>"configure",
"errortype"=>"configure_error"}
+ {"origin"=>"editors/openoffice-4", "phase"=>"build",
"errortype"=>"bad_C++_code"}
+ {"origin"=>"editors/openoffice-devel", "phase"=>"build",
"errortype"=>"bad_C++_code"}
+ {"origin"=>"games/flightgear-terragear", "phase"=>"build",
"errortype"=>"bad_C++_code"}
+ {"origin"=>"games/vegastrike", "phase"=>"build", "errortype"=>"bad_C++_code"}
+ {"origin"=>"graphics/caffe", "phase"=>"build", "errortype"=>"bad_C++_code"}
+ {"origin"=>"graphics/gsculpt", "phase"=>"build", "errortype"=>"bad_C++_code"}
+ {"origin"=>"graphics/pcl-pointclouds", "phase"=>"build",
"errortype"=>"bad_C++_code"}
+ {"origin"=>"graphics/py-openimageio", "phase"=>"stage",
"errortype"=>"bad_C++_code"}
+ {"origin"=>"lang/solidity", "phase"=>"build", "errortype"=>"bad_C++_code"}
+ {"origin"=>"net-p2p/monero-cli", "phase"=>"build",
"errortype"=>"bad_C++_code"}
+ {"origin"=>"sysutils/condor", "phase"=>"build", "errortype"=>"bad_C++_code"}

--
You are receiving this mail because:
You are on the CC list for the bug.
_______________________________________________
[hidden email] mailing list
https://lists.freebsd.org/mailman/listinfo/freebsd-office
To unsubscribe, send any mail to "[hidden email]"
Reply | Threaded
Open this post in threaded view
|

[Bug 227427] devel/boost-all: Update to 1.67.0

bugzilla-noreply
In reply to this post by bugzilla-noreply
https://bugs.freebsd.org/bugzilla/show_bug.cgi?id=227427

--- Comment #19 from Antoine Brodin <[hidden email]> ---
Exp-run results on 11.1 i386:

http://package23.nyi.freebsd.org/build.html?mastername=111i386-default-PR227427&build=2018-04-17_17h22m58s

New failure on 11.1 i386:

+ {"origin"=>"comms/gnuradio", "phase"=>"build", "errortype"=>"???"}
+ {"origin"=>"devel/RStudio", "phase"=>"build", "errortype"=>"???"}
+ {"origin"=>"devel/mongo-cxx-driver", "phase"=>"build", "errortype"=>"clang"}
+ {"origin"=>"devel/uatraits", "phase"=>"configure",
"errortype"=>"configure_error"}
+ {"origin"=>"editors/openoffice-4", "phase"=>"build", "errortype"=>"clang"}
+ {"origin"=>"editors/openoffice-devel", "phase"=>"build",
"errortype"=>"clang"}
+ {"origin"=>"games/vegastrike", "phase"=>"build", "errortype"=>"linker_error"}
+ {"origin"=>"graphics/caffe", "phase"=>"build", "errortype"=>"linker_error"}
+ {"origin"=>"graphics/gsculpt", "phase"=>"build", "errortype"=>"linker_error"}
+ {"origin"=>"graphics/pcl-pointclouds", "phase"=>"build",
"errortype"=>"clang"}
+ {"origin"=>"graphics/py-openimageio", "phase"=>"stage",
"errortype"=>"install_error"}
+ {"origin"=>"net-p2p/monero-cli", "phase"=>"build", "errortype"=>"???"}
+ {"origin"=>"sysutils/condor", "phase"=>"build", "errortype"=>"bad_C++_code"}

--
You are receiving this mail because:
You are on the CC list for the bug.
_______________________________________________
[hidden email] mailing list
https://lists.freebsd.org/mailman/listinfo/freebsd-office
To unsubscribe, send any mail to "[hidden email]"
Reply | Threaded
Open this post in threaded view
|

[Bug 227427] devel/boost-all: Update to 1.67.0

bugzilla-noreply
In reply to this post by bugzilla-noreply
https://bugs.freebsd.org/bugzilla/show_bug.cgi?id=227427

--- Comment #20 from [hidden email] ---
A commit references this bug:

Author: jbeich
Date: Wed Apr 18 06:38:30 UTC 2018
New revision: 467677
URL: https://svnweb.freebsd.org/changeset/ports/467677

Log:
  databases/mongodb36: unbreak with boost 1.67

  In file included from src/third_party/yaml-cpp-0.5.3/src/nodebuilder.cpp:5:
  In file included from
src/third_party/yaml-cpp-0.5.3/include/yaml-cpp/node/detail/node.h:14:
  In file included from
src/third_party/yaml-cpp-0.5.3/include/yaml-cpp/node/detail/node_ref.h:13:
  In file included from
src/third_party/yaml-cpp-0.5.3/include/yaml-cpp/node/detail/node_data.h:20:
  In file included from
src/third_party/yaml-cpp-0.5.3/include/yaml-cpp/node/iterator.h:13:
  src/third_party/yaml-cpp-0.5.3/include/yaml-cpp/node/detail/iterator.h:48:54:
error: no member named 'next' in namespace 'boost'
    void increment() { this->base_reference() = boost::next(this->base()); }
                                                ~~~~~~~^

  PR:           227427
  Reported by:  antoine (via exp-run)

Changes:
  head/databases/mongodb36/files/patch-boost-1.67

--
You are receiving this mail because:
You are on the CC list for the bug.
_______________________________________________
[hidden email] mailing list
https://lists.freebsd.org/mailman/listinfo/freebsd-office
To unsubscribe, send any mail to "[hidden email]"
Reply | Threaded
Open this post in threaded view
|

[Bug 227427] devel/boost-all: Update to 1.67.0

bugzilla-noreply
In reply to this post by bugzilla-noreply
https://bugs.freebsd.org/bugzilla/show_bug.cgi?id=227427

--- Comment #21 from [hidden email] ---
A commit references this bug:

Author: jbeich
Date: Wed Apr 18 06:38:59 UTC 2018
New revision: 467678
URL: https://svnweb.freebsd.org/changeset/ports/467678

Log:
  databases/mongodb34: unbreak with boost 1.67

  In file included from src/third_party/yaml-cpp-0.5.3/src/convert.cpp:3:
  In file included from
src/third_party/yaml-cpp-0.5.3/include/yaml-cpp/node/convert.h:17:
  In file included from
src/third_party/yaml-cpp-0.5.3/include/yaml-cpp/node/impl.h:11:
  In file included from
src/third_party/yaml-cpp-0.5.3/include/yaml-cpp/node/iterator.h:13:
  src/third_party/yaml-cpp-0.5.3/include/yaml-cpp/node/detail/iterator.h:48:54:
error: no member named 'next' in namespace 'boost'
    void increment() { this->base_reference() = boost::next(this->base()); }
                                                ~~~~~~~^

  PR:           227427
  Reported by:  antoine (via exp-run)

Changes:
  head/databases/mongodb34/files/patch-boost-1.67

--
You are receiving this mail because:
You are on the CC list for the bug.
_______________________________________________
[hidden email] mailing list
https://lists.freebsd.org/mailman/listinfo/freebsd-office
To unsubscribe, send any mail to "[hidden email]"
Reply | Threaded
Open this post in threaded view
|

[Bug 227427] devel/boost-all: Update to 1.67.0

bugzilla-noreply
In reply to this post by bugzilla-noreply
https://bugs.freebsd.org/bugzilla/show_bug.cgi?id=227427

--- Comment #22 from [hidden email] ---
A commit references this bug:

Author: jbeich
Date: Wed Apr 18 06:39:11 UTC 2018
New revision: 467679
URL: https://svnweb.freebsd.org/changeset/ports/467679

Log:
  devel/mongo-cxx-driver: unbreak with boost 1.67

  src/mongo/client/command_writer.cpp:68:78: error: no member named 'next' in
namespace 'boost'
              const std::vector<WriteOperation*>::const_iterator next =
boost::next(batch_iter);
                                                                       
~~~~~~~^
  src/mongo/util/net/message_port.h:34:38: error: expected class name
  class AbstractMessagingPort : boost::noncopyable {
                                       ^

  PR:           227427
  Reported by:  antoine (via exp-run)

Changes:
  head/devel/mongo-cxx-driver/files/patch-boost-1.67

--
You are receiving this mail because:
You are on the CC list for the bug.
_______________________________________________
[hidden email] mailing list
https://lists.freebsd.org/mailman/listinfo/freebsd-office
To unsubscribe, send any mail to "[hidden email]"
Reply | Threaded
Open this post in threaded view
|

[Bug 227427] devel/boost-all: Update to 1.67.0

bugzilla-noreply
In reply to this post by bugzilla-noreply
https://bugs.freebsd.org/bugzilla/show_bug.cgi?id=227427

--- Comment #23 from [hidden email] ---
A commit references this bug:

Author: jbeich
Date: Wed Apr 18 06:39:24 UTC 2018
New revision: 467680
URL: https://svnweb.freebsd.org/changeset/ports/467680

Log:
  graphics/py-openimageio: unbreak with boost 1.67

  -- Boost python support not found -- will not build python components!
  [...]
  install  -s -m 0644
/wrkdirs/usr/ports/graphics/py-openimageio/work/.build/src/python/OpenImageIO.so
/wrkdirs/usr/ports/graphics/py-openimageio/work/stage/usr/local/lib/python2.7/site-packages
  install:
/wrkdirs/usr/ports/graphics/py-openimageio/work/.build/src/python/OpenImageIO.so:
No such file or directory

  PR:           227427
  Reported by:  antoine (via exp-run)

Changes:
  head/graphics/openimageio/Makefile

--
You are receiving this mail because:
You are on the CC list for the bug.
_______________________________________________
[hidden email] mailing list
https://lists.freebsd.org/mailman/listinfo/freebsd-office
To unsubscribe, send any mail to "[hidden email]"
Reply | Threaded
Open this post in threaded view
|

[Bug 227427] devel/boost-all: Update to 1.67.0

bugzilla-noreply
In reply to this post by bugzilla-noreply
https://bugs.freebsd.org/bugzilla/show_bug.cgi?id=227427

--- Comment #24 from [hidden email] ---
A commit references this bug:

Author: jbeich
Date: Wed Apr 18 06:39:51 UTC 2018
New revision: 467682
URL: https://svnweb.freebsd.org/changeset/ports/467682

Log:
  devel/uatraits: unbreak with boost 1.67

  checking for boost_python... boost_python
  checking boost/python.hpp usability... yes
  checking boost/python.hpp presence... yes
  checking for boost/python.hpp... yes
  checking linkage with boost::python... no
  [...]
  configure: error: boost python isn't installed for python binding

  PR:           227427
  Reported by:  antoine (via exp-run)

Changes:
  head/devel/uatraits/Makefile

--
You are receiving this mail because:
You are on the CC list for the bug.
_______________________________________________
[hidden email] mailing list
https://lists.freebsd.org/mailman/listinfo/freebsd-office
To unsubscribe, send any mail to "[hidden email]"
Reply | Threaded
Open this post in threaded view
|

[Bug 227427] devel/boost-all: Update to 1.67.0

bugzilla-noreply
In reply to this post by bugzilla-noreply
https://bugs.freebsd.org/bugzilla/show_bug.cgi?id=227427

--- Comment #25 from [hidden email] ---
A commit references this bug:

Author: jbeich
Date: Wed Apr 18 08:04:04 UTC 2018
New revision: 467687
URL: https://svnweb.freebsd.org/changeset/ports/467687

Log:
  graphics/caffe: unbreak with boost 1.67

  /usr/local/bin/ld: cannot find -lboost_python
  clang++: error: linker command failed with exit code 1 (use -v to see
invocation)
  gmake[1]: *** [Makefile:508: python/caffe/_caffe.so] Error 1

  PR:           227427
  Reported by:  antoine (via exp-run)

Changes:
  head/graphics/caffe/Makefile

--
You are receiving this mail because:
You are on the CC list for the bug.
_______________________________________________
[hidden email] mailing list
https://lists.freebsd.org/mailman/listinfo/freebsd-office
To unsubscribe, send any mail to "[hidden email]"
Reply | Threaded
Open this post in threaded view
|

[Bug 227427] devel/boost-all: Update to 1.67.0

bugzilla-noreply
In reply to this post by bugzilla-noreply
https://bugs.freebsd.org/bugzilla/show_bug.cgi?id=227427

--- Comment #26 from [hidden email] ---
A commit references this bug:

Author: jbeich
Date: Wed Apr 18 08:16:17 UTC 2018
New revision: 467688
URL: https://svnweb.freebsd.org/changeset/ports/467688

Log:
  sysutils/condor: unbreak with boost 1.67

  [ 98%] Linking CXX shared library libclassad_python_user.so
  /usr/bin/ld: cannot find -lboost_python

  PR:           227427
  Reported by:  antoine (via exp-run)

Changes:
  head/sysutils/condor/Makefile
  head/sysutils/condor/files/patch-src_python-bindings_CMakeLists.txt

--
You are receiving this mail because:
You are on the CC list for the bug.
_______________________________________________
[hidden email] mailing list
https://lists.freebsd.org/mailman/listinfo/freebsd-office
To unsubscribe, send any mail to "[hidden email]"
Reply | Threaded
Open this post in threaded view
|

[Bug 227427] devel/boost-all: Update to 1.67.0

bugzilla-noreply
In reply to this post by bugzilla-noreply
https://bugs.freebsd.org/bugzilla/show_bug.cgi?id=227427

--- Comment #27 from [hidden email] ---
A commit references this bug:

Author: jbeich
Date: Wed Apr 18 08:33:49 UTC 2018
New revision: 467692
URL: https://svnweb.freebsd.org/changeset/ports/467692

Log:
  graphics/gsculpt: unbreak with boost 1.67

  /usr/bin/ld: cannot find -lboost_python
  c++: error: linker command failed with exit code 1 (use -v to see invocation)
  scons: *** [libMath.so] Error 1

  PR:           227427
  Reported by:  antoine (via exp-run)

Changes:
  head/graphics/gsculpt/Makefile

--
You are receiving this mail because:
You are on the CC list for the bug.
_______________________________________________
[hidden email] mailing list
https://lists.freebsd.org/mailman/listinfo/freebsd-office
To unsubscribe, send any mail to "[hidden email]"
Reply | Threaded
Open this post in threaded view
|

[Bug 227427] devel/boost-all: Update to 1.67.0

bugzilla-noreply
In reply to this post by bugzilla-noreply
https://bugs.freebsd.org/bugzilla/show_bug.cgi?id=227427

--- Comment #28 from [hidden email] ---
A commit references this bug:

Author: jbeich
Date: Wed Apr 18 08:34:06 UTC 2018
New revision: 467693
URL: https://svnweb.freebsd.org/changeset/ports/467693

Log:
  games/vegastrike: unbreak with boost 1.67

  /usr/bin/ld: cannot find -lboost_python
  c++: error: linker command failed with exit code 1 (use -v to see invocation)
  gmake[2]: *** [Makefile:3504: vegastrike] Error 1

  PR:           227427
  Reported by:  antoine (via exp-run)

Changes:
  head/games/vegastrike/Makefile

--
You are receiving this mail because:
You are on the CC list for the bug.
_______________________________________________
[hidden email] mailing list
https://lists.freebsd.org/mailman/listinfo/freebsd-office
To unsubscribe, send any mail to "[hidden email]"
Reply | Threaded
Open this post in threaded view
|

[Bug 227427] devel/boost-all: Update to 1.67.0

bugzilla-noreply
In reply to this post by bugzilla-noreply
https://bugs.freebsd.org/bugzilla/show_bug.cgi?id=227427

--- Comment #29 from [hidden email] ---
A commit references this bug:

Author: jbeich
Date: Wed Apr 18 09:13:00 UTC 2018
New revision: 467696
URL: https://svnweb.freebsd.org/changeset/ports/467696

Log:
  net/ceph: unbreak with boost 1.67

  src/rbd_replay/Replayer.cc:353:65: error: no matching conversion for
functional-style cast from 'float' to 'boost::posix_time::microseconds' (aka
'subsecond_duration<boost::posix_time::time_duration, 1000000>')
      boost::system_time sub_release_time(action_completed_time +
boost::posix_time::microseconds(dep.time_delta * m_latency_multiplier / 1000));
                                                                 
^~~~~~~~~~~~~~~~~~~~~~~~~~~~~~~~~~~~~~~~~~~~~~~~~~~~~~~~~~~~~~~~~~~~~~~~~~~~

  PR:           227427
  Reported by:  antoine (via exp-run)

Changes:
  head/net/ceph/files/patch-boost-1.67

--
You are receiving this mail because:
You are on the CC list for the bug.
_______________________________________________
[hidden email] mailing list
https://lists.freebsd.org/mailman/listinfo/freebsd-office
To unsubscribe, send any mail to "[hidden email]"
Reply | Threaded
Open this post in threaded view
|

[Bug 227427] devel/boost-all: Update to 1.67.0

bugzilla-noreply
In reply to this post by bugzilla-noreply
https://bugs.freebsd.org/bugzilla/show_bug.cgi?id=227427

--- Comment #30 from [hidden email] ---
A commit references this bug:

Author: jbeich
Date: Wed Apr 18 09:13:15 UTC 2018
New revision: 467697
URL: https://svnweb.freebsd.org/changeset/ports/467697

Log:
  net-p2p/monero-cli: unbreak with boost 1.67

  In file included from src/cryptonote_basic/hardfork.cpp:33:
  In file included from src/blockchain_db/blockchain_db.h:42:
  In file included from src/cryptonote_basic/hardfork.h:31:
  contrib/epee/include/syncobj.h:37:10: fatal error:
'boost/thread/v2/thread.hpp' file not found
   #include <boost/thread/v2/thread.hpp>
            ^~~~~~~~~~~~~~~~~~~~~~~~~~~~
  In file included from src/rpc/daemon_handler.cpp:29:
  In file included from src/rpc/daemon_handler.h:36:
  In file included from src/p2p/net_node.h:41:
  In file included from contrib/epee/include/net/levin_server_cp2.h:32:
  In file included from contrib/epee/include/net/abstract_tcp_server2.h:324:
  contrib/epee/include/net/abstract_tcp_server2.inl:44:10: fatal error:
'boost/thread/v2/thread.hpp' file not found
   #include <boost/thread/v2/thread.hpp> // TODO
            ^~~~~~~~~~~~~~~~~~~~~~~~~~~~

  PR:           227427
  Reported by:  antoine (via exp-run)

Changes:
  head/net-p2p/monero-cli/files/patch-boost-1.67

--
You are receiving this mail because:
You are on the CC list for the bug.
_______________________________________________
[hidden email] mailing list
https://lists.freebsd.org/mailman/listinfo/freebsd-office
To unsubscribe, send any mail to "[hidden email]"
Reply | Threaded
Open this post in threaded view
|

[Bug 227427] devel/boost-all: Update to 1.67.0

bugzilla-noreply
In reply to this post by bugzilla-noreply
https://bugs.freebsd.org/bugzilla/show_bug.cgi?id=227427

--- Comment #31 from [hidden email] ---
A commit references this bug:

Author: jbeich
Date: Wed Apr 18 10:17:35 UTC 2018
New revision: 467699
URL: https://svnweb.freebsd.org/changeset/ports/467699

Log:
  devel/RStudio: unbreak with boost 1.67

  src/cpp/core/DateTime.cpp:68:26: error: no matching conversion for
functional-style cast from 'double' to 'boost::posix_time::seconds'
     return time_t_epoch + seconds(sec);
                           ^~~~~~~~~~~
  /usr/local/include/boost/date_time/posix_time/posix_time_duration.hpp:53:30:
note: candidate constructor (the implicit copy constructor) not viable: no
known conversion from 'double' to 'const boost::posix_time::seconds' for 1st
argument
    class BOOST_SYMBOL_VISIBLE seconds : public time_duration
                               ^
  /usr/local/include/boost/date_time/posix_time/posix_time_duration.hpp:58:37:
note: candidate template ignored: disabled by 'enable_if' [with T = double]
            typename boost::enable_if<boost::is_integral<T>, void>::type* = 0)
:
                                      ^

  PR:           227427
  Reported by:  antoine (via exp-run)

Changes:
  head/devel/RStudio/Makefile
  head/devel/RStudio/files/patch-boost-1.67

--
You are receiving this mail because:
You are on the CC list for the bug.
_______________________________________________
[hidden email] mailing list
https://lists.freebsd.org/mailman/listinfo/freebsd-office
To unsubscribe, send any mail to "[hidden email]"
Reply | Threaded
Open this post in threaded view
|

[Bug 227427] devel/boost-all: Update to 1.67.0

bugzilla-noreply
In reply to this post by bugzilla-noreply
https://bugs.freebsd.org/bugzilla/show_bug.cgi?id=227427

--- Comment #32 from [hidden email] ---
A commit references this bug:

Author: jbeich
Date: Wed Apr 18 12:38:19 UTC 2018
New revision: 467709
URL: https://svnweb.freebsd.org/changeset/ports/467709

Log:
  comms/gnuradio: unbreak with boost 1.67

  gr-blocks/lib/message_strobe_impl.cc:93:35: error: no matching conversion for
functional-style cast from 'float' to 'boost::posix_time::milliseconds' (aka
'subsecond_duration<boost::posix_time::time_duration, 1000>')
         
boost::this_thread::sleep(boost::posix_time::milliseconds(d_period_ms));
                                    ^~~~~~~~~~~~~~~~~~~~~~~~~~~~~~~~~~~~~~~~~~~
  /usr/local/include/boost/date_time/time_duration.hpp:270:30: note: candidate
constructor (the implicit copy constructor) not viable: no known conversion
from 'float' to 'const
boost::date_time::subsecond_duration<boost::posix_time::time_duration, 1000>'
for 1st argument
    class BOOST_SYMBOL_VISIBLE subsecond_duration : public base_duration
                               ^
  /usr/local/include/boost/date_time/time_duration.hpp:286:59: note: candidate
template ignored: disabled by 'enable_if' [with T = float]
                                  typename
boost::enable_if<boost::is_integral<T>, void>::type* = 0) :
                                                            ^

  /usr/local/bin/ld: CMakeFiles/tags_demo.dir/tags_demo.cc.o: undefined
reference to symbol 'pthread_condattr_init@@FBSD_1.0'
  //lib/libthr.so.3: error adding symbols: DSO missing from command line
  c++: error: linker command failed with exit code 1 (use -v to see invocation)
  *** [gr-uhd/examples/c++/tags_demo] Error code 1

  PR:           227427
  Reported by:  antoine (via exp-run)
  Obtained from:        Homebrew

Changes:
  head/comms/gnuradio/files/patch-boost-1.67

--
You are receiving this mail because:
You are on the CC list for the bug.
_______________________________________________
[hidden email] mailing list
https://lists.freebsd.org/mailman/listinfo/freebsd-office
To unsubscribe, send any mail to "[hidden email]"
Reply | Threaded
Open this post in threaded view
|

[Bug 227427] devel/boost-all: Update to 1.67.0

bugzilla-noreply
In reply to this post by bugzilla-noreply
https://bugs.freebsd.org/bugzilla/show_bug.cgi?id=227427
Bug 227427 depends on bug 227540, which changed state.

Bug 227540 Summary: comms/gnuradio: fails to build with boost 1.67
https://bugs.freebsd.org/bugzilla/show_bug.cgi?id=227540

           What    |Removed                     |Added
----------------------------------------------------------------------------
             Status|New                         |Closed
         Resolution|---                         |FIXED

--
You are receiving this mail because:
You are on the CC list for the bug.
_______________________________________________
[hidden email] mailing list
https://lists.freebsd.org/mailman/listinfo/freebsd-office
To unsubscribe, send any mail to "[hidden email]"
123