FreeBSD_HEAD_i386 - Build #1621 - Failure

classic Classic list List threaded Threaded
2 messages Options
Reply | Threaded
Open this post in threaded view
|

FreeBSD_HEAD_i386 - Build #1621 - Failure

jenkins-admin
FreeBSD_HEAD_i386 - Build #1621 - Failure:

Build information: https://jenkins.FreeBSD.org/job/FreeBSD_HEAD_i386/1621/
Full change log: https://jenkins.FreeBSD.org/job/FreeBSD_HEAD_i386/1621/changes
Full build log: https://jenkins.FreeBSD.org/job/FreeBSD_HEAD_i386/1621/console

Change summaries:

290538 by ngie:
Integrate tools/regression/lib/libc/stdlib into the FreeBSD test suite
as lib/libc/tests/stdlib

- Make the code a bit more style(9) compliant
- Convert a sizeof(x)/sizeof(x[0]) to nitems

MFC after: 1 week
Sponsored by: EMC / Isilon Storage Division

290537 by ngie:
Integrate tools/regression/lib/libc/stdio into the FreeBSD test suite
as lib/libc/tests/stdio

- Fix some whitespace
- Convert the testcases to ATF
- Convert "/dev/null" to _PATH_DEVNULL

MFC after: 1 week
Sponsored by: EMC / Isilon Storage Division



The end of the build log:

[...truncated 95043 lines...]
--- open_wmemstream_test.o ---
cc  -O2 -pipe   -std=gnu99 -fstack-protector-strong   -Qunused-arguments -c /usr/src/lib/libc/tests/stdio/open_wmemstream_test.c -o open_wmemstream_test.o
--- all_subdir_gnu ---
--- mipsread.o ---
cc   -O2 -pipe   -Dxregcomp=regcomp -Dxre_exec=re_exec -Dxregexec=regexec -Dxre_search=re_search -Dxre_compile_fastmap=re_compile_fastmap -Dxregerror=regerror -Dxre_comp=re_comp -Dxre_set_syntax=re_set_syntax -DHAVE_CONFIG_H -DRL_NO_COMPAT -DMI_OUT=1 -DTUI=1 -DDEBUGDIR=\"/usr/lib/debug\" -I. -I/usr/src/gnu/usr.bin/gdb/libgdb/../arch/i386 -I/usr/src/gnu/usr.bin/gdb/libgdb/../../binutils/libbfd -I/usr/src/gnu/usr.bin/gdb/libgdb/../../binutils/libbfd/i386 -I/usr/src/gnu/usr.bin/gdb/libgdb/../../../../contrib/gdb/gdb -I/usr/src/gnu/usr.bin/gdb/libgdb/../../../../contrib/gdb/gdb/config -I/usr/src/gnu/usr.bin/gdb/libgdb/../../../../contrib/binutils/include -I/usr/src/gnu/usr.bin/gdb/libgdb/../../../../contrib/gdb/include -I/usr/src/gnu/usr.bin/gdb/libgdb/../../../../contrib/binutils/bfd -I/usr/obj/usr/src/gnu/usr.bin/gdb/libgdb/../../../lib/libreadline/readline/.. -std=gnu99 -fstack-protector-strong   -Qunused-arguments -c /usr/src/gnu/usr.bin/gdb/libgdb/../../../../contrib/gdb/gdb/mipsrea
 d.c -o mipsread.o
--- all_subdir_lib ---
--- open_wmemstream_test ---
cc -O2 -pipe -std=gnu99 -fstack-protector-strong -Qunused-arguments  -o open_wmemstream_test open_wmemstream_test.o  -lprivateatf-c
--- perror_test ---
(cd /usr/src/lib/libc/tests/stdio &&  DEPENDFILE=.depend.perror_test  NO_SUBDIR=1 make -f /usr/src/lib/libc/tests/stdio/Makefile _RECURSING_PROGS=  PROG=perror_test )
--- all_subdir_kerberos5 ---
--- pkinit.po ---
--- all_subdir_lib ---
--- perror_test.o ---
--- all_subdir_kerberos5 ---
cc  -pg  -O2 -pipe   -I/usr/src/kerberos5/lib/libkrb5/../../../crypto/heimdal/lib/krb5  -I/usr/src/kerberos5/lib/libkrb5/../../../crypto/heimdal/lib/asn1  -I/usr/src/kerberos5/lib/libkrb5/../../../crypto/heimdal/lib/roken  -I/usr/src/kerberos5/lib/libkrb5/../../../crypto/heimdal/lib/ipc  -I/usr/src/kerberos5/lib/libkrb5/../../../crypto/heimdal/base -I. -DHAVE_CONFIG_H -I/usr/src/kerberos5/lib/libkrb5/../../include -std=gnu99 -fstack-protector-strong   -Qunused-arguments -c /usr/src/kerberos5/lib/libkrb5/../../../crypto/heimdal/lib/krb5/pkinit.c -o pkinit.po
--- all_subdir_lib ---
cc  -O2 -pipe   -std=gnu99 -fstack-protector-strong   -Qunused-arguments -c /usr/src/lib/libc/tests/stdio/perror_test.c -o perror_test.o
--- all_subdir_gnu ---
--- nlmread.o ---
cc   -O2 -pipe   -Dxregcomp=regcomp -Dxre_exec=re_exec -Dxregexec=regexec -Dxre_search=re_search -Dxre_compile_fastmap=re_compile_fastmap -Dxregerror=regerror -Dxre_comp=re_comp -Dxre_set_syntax=re_set_syntax -DHAVE_CONFIG_H -DRL_NO_COMPAT -DMI_OUT=1 -DTUI=1 -DDEBUGDIR=\"/usr/lib/debug\" -I. -I/usr/src/gnu/usr.bin/gdb/libgdb/../arch/i386 -I/usr/src/gnu/usr.bin/gdb/libgdb/../../binutils/libbfd -I/usr/src/gnu/usr.bin/gdb/libgdb/../../binutils/libbfd/i386 -I/usr/src/gnu/usr.bin/gdb/libgdb/../../../../contrib/gdb/gdb -I/usr/src/gnu/usr.bin/gdb/libgdb/../../../../contrib/gdb/gdb/config -I/usr/src/gnu/usr.bin/gdb/libgdb/../../../../contrib/binutils/include -I/usr/src/gnu/usr.bin/gdb/libgdb/../../../../contrib/gdb/include -I/usr/src/gnu/usr.bin/gdb/libgdb/../../../../contrib/binutils/bfd -I/usr/obj/usr/src/gnu/usr.bin/gdb/libgdb/../../../lib/libreadline/readline/.. -std=gnu99 -fstack-protector-strong   -Qunused-arguments -c /usr/src/gnu/usr.bin/gdb/libgdb/../../../../contrib/gdb/gdb/nlmread
 .c -o nlmread.o
--- all_subdir_lib ---
--- perror_test ---
cc -O2 -pipe -std=gnu99 -fstack-protector-strong -Qunused-arguments  -o perror_test perror_test.o  -lprivateatf-c
--- print_positional_test ---
(cd /usr/src/lib/libc/tests/stdio &&  DEPENDFILE=.depend.print_positional_test  NO_SUBDIR=1 make -f /usr/src/lib/libc/tests/stdio/Makefile _RECURSING_PROGS=  PROG=print_positional_test )
--- print_positional_test.o ---
cc  -O2 -pipe   -std=gnu99 -fstack-protector-strong   -Qunused-arguments -c /usr/src/lib/libc/tests/stdio/print_positional_test.c -o print_positional_test.o
--- all_subdir_gnu ---
--- objc-lang.o ---
cc   -O2 -pipe   -Dxregcomp=regcomp -Dxre_exec=re_exec -Dxregexec=regexec -Dxre_search=re_search -Dxre_compile_fastmap=re_compile_fastmap -Dxregerror=regerror -Dxre_comp=re_comp -Dxre_set_syntax=re_set_syntax -DHAVE_CONFIG_H -DRL_NO_COMPAT -DMI_OUT=1 -DTUI=1 -DDEBUGDIR=\"/usr/lib/debug\" -I. -I/usr/src/gnu/usr.bin/gdb/libgdb/../arch/i386 -I/usr/src/gnu/usr.bin/gdb/libgdb/../../binutils/libbfd -I/usr/src/gnu/usr.bin/gdb/libgdb/../../binutils/libbfd/i386 -I/usr/src/gnu/usr.bin/gdb/libgdb/../../../../contrib/gdb/gdb -I/usr/src/gnu/usr.bin/gdb/libgdb/../../../../contrib/gdb/gdb/config -I/usr/src/gnu/usr.bin/gdb/libgdb/../../../../contrib/binutils/include -I/usr/src/gnu/usr.bin/gdb/libgdb/../../../../contrib/gdb/include -I/usr/src/gnu/usr.bin/gdb/libgdb/../../../../contrib/binutils/bfd -I/usr/obj/usr/src/gnu/usr.bin/gdb/libgdb/../../../lib/libreadline/readline/.. -std=gnu99 -fstack-protector-strong   -Qunused-arguments -c /usr/src/gnu/usr.bin/gdb/libgdb/../../../../contrib/gdb/gdb/objc-la
 ng.c -o objc-lang.o
--- all_subdir_lib ---
--- print_positional_test ---
cc -O2 -pipe -std=gnu99 -fstack-protector-strong -Qunused-arguments  -o print_positional_test print_positional_test.o  -lprivateatf-c
--- printbasic_test ---
(cd /usr/src/lib/libc/tests/stdio &&  DEPENDFILE=.depend.printbasic_test  NO_SUBDIR=1 make -f /usr/src/lib/libc/tests/stdio/Makefile _RECURSING_PROGS=  PROG=printbasic_test )
--- printbasic_test.o ---
cc  -O2 -pipe   -std=gnu99 -fstack-protector-strong   -Qunused-arguments -c /usr/src/lib/libc/tests/stdio/printbasic_test.c -o printbasic_test.o
--- printbasic_test ---
cc -O2 -pipe -std=gnu99 -fstack-protector-strong -Qunused-arguments  -o printbasic_test printbasic_test.o  -lprivateatf-c
--- printfloat_test ---
(cd /usr/src/lib/libc/tests/stdio &&  DEPENDFILE=.depend.printfloat_test  NO_SUBDIR=1 make -f /usr/src/lib/libc/tests/stdio/Makefile _RECURSING_PROGS=  PROG=printfloat_test )
--- printfloat_test.o ---
cc  -O2 -pipe   -std=gnu99 -fstack-protector-strong   -Qunused-arguments -c /usr/src/lib/libc/tests/stdio/printfloat_test.c -o printfloat_test.o
--- all_subdir_rescue ---
--- reboot_make ---
(cd /usr/src/rescue/rescue/../../sbin/reboot &&  make -DRESCUE CRUNCH_CFLAGS=-DRESCUE DIRPRFX=rescue/rescue/reboot/ depend && make -DRESCUE CRUNCH_CFLAGS=-DRESCUE DIRPRFX=rescue/rescue/reboot/ reboot.o)
--- .depend ---
rm -f .depend
CC='cc' mkdep -f .depend -a    -DRESCUE -std=gnu99   /usr/src/sbin/reboot/reboot.c
echo reboot: /usr/obj/usr/src/tmp/usr/lib/libc.a  >> .depend
--- reboot.o ---
cc  -O2 -pipe   -DRESCUE -std=gnu99 -fstack-protector-strong -Wsystem-headers -Werror -Wall -Wno-format-y2k -W -Wno-unused-parameter -Wstrict-prototypes -Wmissing-prototypes -Wpointer-arith -Wreturn-type -Wcast-qual -Wwrite-strings -Wswitch -Wshadow -Wunused-parameter -Wcast-align -Wchar-subscripts -Winline -Wnested-externs -Wredundant-decls -Wold-style-definition -Wno-pointer-sign -Wmissing-variable-declarations -Wthread-safety -Wno-empty-body -Wno-string-plus-int -Wno-unused-const-variable -Qunused-arguments -c /usr/src/sbin/reboot/reboot.c -o reboot.o
--- all_subdir_lib ---
--- printfloat_test ---
cc -O2 -pipe -std=gnu99 -fstack-protector-strong -Qunused-arguments  -o printfloat_test printfloat_test.o  -lprivateatf-c
--- all_subdir_rescue ---
--- restore_make ---
(cd /usr/src/rescue/rescue/../../sbin/restore &&  make -DRESCUE CRUNCH_CFLAGS=-DRESCUE DIRPRFX=rescue/rescue/restore/ depend && make -DRESCUE CRUNCH_CFLAGS=-DRESCUE DIRPRFX=rescue/rescue/restore/ main.o interactive.o restore.o dirs.o symtab.o tape.o utilities.o dumprmt.o)
--- all_subdir_lib ---
printfloat_test.o: In function `atfu_decimal_rounding_body':
/usr/src/lib/libc/tests/stdio/printfloat_test.c:(.text+0x17b3): undefined reference to `__has_sse'
/usr/src/lib/libc/tests/stdio/printfloat_test.c:(.text+0x17c1): undefined reference to `__test_sse'
/usr/src/lib/libc/tests/stdio/printfloat_test.c:(.text+0x18a8): undefined reference to `__has_sse'
/usr/src/lib/libc/tests/stdio/printfloat_test.c:(.text+0x18b6): undefined reference to `__test_sse'
/usr/src/lib/libc/tests/stdio/printfloat_test.c:(.text+0x197f): undefined reference to `__has_sse'
/usr/src/lib/libc/tests/stdio/printfloat_test.c:(.text+0x198d): undefined reference to `__test_sse'
/usr/src/lib/libc/tests/stdio/printfloat_test.c:(.text+0x1a4a): undefined reference to `__has_sse'
/usr/src/lib/libc/tests/stdio/printfloat_test.c:(.text+0x1a58): undefined reference to `__test_sse'
printfloat_test.o: In function `atfu_hexadecimal_rounding_body':
/usr/src/lib/libc/tests/stdio/printfloat_test.c:(.text+0x1e45): undefined reference to `__has_sse'
/usr/src/lib/libc/tests/stdio/printfloat_test.c:(.text+0x1e53): undefined reference to `__test_sse'
/usr/src/lib/libc/tests/stdio/printfloat_test.c:(.text+0x1f5c): undefined reference to `__has_sse'
/usr/src/lib/libc/tests/stdio/printfloat_test.c:(.text+0x1f6a): undefined reference to `__test_sse'
/usr/src/lib/libc/tests/stdio/printfloat_test.c:(.text+0x207f): undefined reference to `__has_sse'
/usr/src/lib/libc/tests/stdio/printfloat_test.c:(.text+0x208d): undefined reference to `__test_sse'
/usr/src/lib/libc/tests/stdio/printfloat_test.c:(.text+0x2194): undefined reference to `__has_sse'
/usr/src/lib/libc/tests/stdio/printfloat_test.c:(.text+0x21a2): undefined reference to `__test_sse'
cc: error: linker command failed with exit code 1 (use -v to see invocation)
*** [printfloat_test] Error code 1

make[7]: stopped in /usr/src/lib/libc/tests/stdio
1 error

make[7]: stopped in /usr/src/lib/libc/tests/stdio
--- all_subdir_rescue ---
A failure has been detected in another branch of the parallel make

make[6]: stopped in /usr/src/sbin/restore
--- all_subdir_lib ---
*** [printfloat_test] Error code 2

make[6]: stopped in /usr/src/lib/libc/tests/stdio
1 error

make[6]: stopped in /usr/src/lib/libc/tests/stdio
--- all_subdir_rescue ---
*** [restore_make] Error code 2

make[5]: stopped in /usr/obj/usr/src/rescue/rescue
1 error

make[5]: stopped in /usr/obj/usr/src/rescue/rescue
--- all_subdir_lib ---
*** [all] Error code 2

make[5]: stopped in /usr/src/lib/libc/tests
1 error

make[5]: stopped in /usr/src/lib/libc/tests
--- all_subdir_rescue ---
*** [objs] Error code 2

make[4]: stopped in /usr/src/rescue/rescue
1 error

make[4]: stopped in /usr/src/rescue/rescue
--- all_subdir_lib ---
*** [all] Error code 2

make[4]: stopped in /usr/src/lib/libc
1 error

make[4]: stopped in /usr/src/lib/libc
--- all_subdir_rescue ---
*** [all] Error code 2

make[3]: stopped in /usr/src/rescue
1 error

make[3]: stopped in /usr/src/rescue
*** [all_subdir_rescue] Error code 2

make[2]: stopped in /usr/src
--- all_subdir_lib ---
*** [all_subdir_libc] Error code 2

make[3]: stopped in /usr/src/lib
1 error

make[3]: stopped in /usr/src/lib
*** [all_subdir_lib] Error code 2

make[2]: stopped in /usr/src
--- all_subdir_gnu ---
A failure has been detected in another branch of the parallel make

make[6]: stopped in /usr/src/gnu/usr.bin/gdb/libgdb
*** [all] Error code 2

make[5]: stopped in /usr/src/gnu/usr.bin/gdb
1 error

make[5]: stopped in /usr/src/gnu/usr.bin/gdb
*** [all_subdir_gdb] Error code 2

make[4]: stopped in /usr/src/gnu/usr.bin
1 error

make[4]: stopped in /usr/src/gnu/usr.bin
*** [all_subdir_usr.bin] Error code 2

make[3]: stopped in /usr/src/gnu
1 error

make[3]: stopped in /usr/src/gnu
*** [all_subdir_gnu] Error code 2

make[2]: stopped in /usr/src
--- all_subdir_kerberos5 ---
A failure has been detected in another branch of the parallel make

make[5]: stopped in /usr/src/kerberos5/lib/libkrb5
*** [all] Error code 2

make[4]: stopped in /usr/src/kerberos5/lib
1 error

make[4]: stopped in /usr/src/kerberos5/lib
*** [all_subdir_lib] Error code 2

make[3]: stopped in /usr/src/kerberos5
1 error

make[3]: stopped in /usr/src/kerberos5
*** [all_subdir_kerberos5] Error code 2

make[2]: stopped in /usr/src
4 errors

make[2]: stopped in /usr/src
*** [everything] Error code 2

make[1]: stopped in /usr/src
1 error

make[1]: stopped in /usr/src
*** [buildworld] Error code 2

make: stopped in /usr/src
1 error

make: stopped in /usr/src
Build step 'Execute shell' marked build as failure
[PostBuildScript] - Execution post build scripts.
No JDK named ?null? found
[FreeBSD_HEAD_i386] $ /bin/sh -xe /tmp/hudson4170629754512512178.sh
+ export 'PATH=/sbin:/bin:/usr/sbin:/usr/bin:/usr/local/sbin:/usr/local/bin'
+ export 'jname=FreeBSD_HEAD_i386'
+ echo 'clean up jail FreeBSD_HEAD_i386'
clean up jail FreeBSD_HEAD_i386
+ sudo jail -r FreeBSD_HEAD_i386
+ sudo ifconfig igb0 inet6 2610:1c1:1:607c::106:1 -alias
+ sudo umount FreeBSD_HEAD_i386/usr/src
+ sudo umount FreeBSD_HEAD_i386/dev
+ sudo rm -fr FreeBSD_HEAD_i386
rm: FreeBSD_HEAD_i386/usr/lib/librt.so.1: Operation not permitted
rm: FreeBSD_HEAD_i386/usr/lib: Directory not empty
rm: FreeBSD_HEAD_i386/usr/bin/chpass: Operation not permitted
rm: FreeBSD_HEAD_i386/usr/bin/opiepasswd: Operation not permitted
rm: FreeBSD_HEAD_i386/usr/bin/ypchpass: Operation not permitted
rm: FreeBSD_HEAD_i386/usr/bin/chsh: Operation not permitted
rm: FreeBSD_HEAD_i386/usr/bin/login: Operation not permitted
rm: FreeBSD_HEAD_i386/usr/bin/su: Operation not permitted
rm: FreeBSD_HEAD_i386/usr/bin/chfn: Operation not permitted
rm: FreeBSD_HEAD_i386/usr/bin/ypchsh: Operation not permitted
rm: FreeBSD_HEAD_i386/usr/bin/ypchfn: Operation not permitted
rm: FreeBSD_HEAD_i386/usr/bin/crontab: Operation not permitted
rm: FreeBSD_HEAD_i386/usr/bin/yppasswd: Operation not permitted
rm: FreeBSD_HEAD_i386/usr/bin/passwd: Operation not permitted
rm: FreeBSD_HEAD_i386/usr/bin/opieinfo: Operation not permitted
rm: FreeBSD_HEAD_i386/usr/bin: Directory not empty
rm: FreeBSD_HEAD_i386/usr: Directory not empty
rm: FreeBSD_HEAD_i386/sbin/init: Operation not permitted
rm: FreeBSD_HEAD_i386/sbin: Directory not empty
rm: FreeBSD_HEAD_i386/lib/libthr.so.3: Operation not permitted
rm: FreeBSD_HEAD_i386/lib/libc.so.7: Operation not permitted
rm: FreeBSD_HEAD_i386/lib/libcrypt.so.5: Operation not permitted
rm: FreeBSD_HEAD_i386/lib: Directory not empty
rm: FreeBSD_HEAD_i386/libexec/ld-elf.so.1: Operation not permitted
rm: FreeBSD_HEAD_i386/libexec: Directory not empty
rm: FreeBSD_HEAD_i386: Directory not empty
+ true
+ sudo chflags -R noschg FreeBSD_HEAD_i386
+ sudo rm -fr FreeBSD_HEAD_i386
Email was triggered for: Failure - Any
Sending email for trigger: Failure - Any
No JDK named ?null? found
No JDK named ?null? found
_______________________________________________
[hidden email] mailing list
https://lists.freebsd.org/mailman/listinfo/freebsd-i386
To unsubscribe, send any mail to "[hidden email]"
Reply | Threaded
Open this post in threaded view
|

FreeBSD_HEAD_i386 - Build #1622 - Fixed

jenkins-admin
FreeBSD_HEAD_i386 - Build #1622 - Fixed:

Build information: https://jenkins.FreeBSD.org/job/FreeBSD_HEAD_i386/1622/
Full change log: https://jenkins.FreeBSD.org/job/FreeBSD_HEAD_i386/1622/changes
Full build log: https://jenkins.FreeBSD.org/job/FreeBSD_HEAD_i386/1622/console

Change summaries:

290541 by skra:
Make usermode variable the bool type. It's already used that way.

Suggested by: kib
Approved by: kib (mentor)

290540 by ngie:
printfloat_test and scanfloat_test need symbols from msun; these are automatically
provided on amd64, but not i386. Add libm to DPADD/LDADD to unbreak the i386
tinderbox

Pointyhat to: ngie
MFC after: 1 week
X-MFC with: r290538
Sponsored by: EMC / Isilon Storage Division

290539 by ngie:
Integrate tools/regression/lib/libc/string into the FreeBSD test suite
as lib/libc/tests/string

MFC after: 1 week
Sponsored by: EMC / Isilon Storage Division

_______________________________________________
[hidden email] mailing list
https://lists.freebsd.org/mailman/listinfo/freebsd-i386
To unsubscribe, send any mail to "[hidden email]"