[exp - 121amd64-default-build-as-user][lang/fsharp] Failed for fsharp-10.2.1 in build

classic Classic list List threaded Threaded
1 message Options
Reply | Threaded
Open this post in threaded view
|

[exp - 121amd64-default-build-as-user][lang/fsharp] Failed for fsharp-10.2.1 in build

pkg-fallout
You are receiving this mail as a port that you maintain
is failing to build on the FreeBSD package build server.
Please investigate the failure and submit a PR to fix
build.

Maintainer:     [hidden email]
Last committer: [hidden email]
Ident:          $FreeBSD: head/lang/fsharp/Makefile 480109 2018-09-19 19:54:47Z dbn $
Log URL:        http://package19.nyi.freebsd.org/data/121amd64-default-build-as-user/532434/logs/fsharp-10.2.1.log
Build URL:      http://package19.nyi.freebsd.org/build.html?mastername=121amd64-default-build-as-user&build=532434
Log:

=>> Building lang/fsharp
build started at Wed Apr 22 19:09:18 UTC 2020
port directory: /usr/ports/lang/fsharp
package name: fsharp-10.2.1
building for: FreeBSD 121amd64-default-build-as-user-job-06 12.1-RELEASE-p4 FreeBSD 12.1-RELEASE-p4 amd64
maintained by: [hidden email]
Makefile ident:      $FreeBSD: head/lang/fsharp/Makefile 480109 2018-09-19 19:54:47Z dbn $
Poudriere version: 3.2.8-5-gc81843e5
Host OSVERSION: 1300076
Jail OSVERSION: 1201000
Job Id: 06

---Begin Environment---
SHELL=/bin/csh
OSVERSION=1201000
UNAME_v=FreeBSD 12.1-RELEASE-p4
UNAME_r=12.1-RELEASE-p4
BLOCKSIZE=K
MAIL=/var/mail/root
STATUS=1
HOME=/root
PATH=/sbin:/bin:/usr/sbin:/usr/bin:/usr/local/sbin:/usr/local/bin:/root/bin
LOCALBASE=/usr/local
USER=root
LIBEXECPREFIX=/usr/local/libexec/poudriere
POUDRIERE_VERSION=3.2.8-5-gc81843e5
MASTERMNT=/poudriere/data/.m/121amd64-default-build-as-user/ref
POUDRIERE_BUILD_TYPE=bulk
PACKAGE_BUILDING=yes
SAVED_TERM=
GID=0
UID=0
PWD=/poudriere/data/.m/121amd64-default-build-as-user/ref/.p/pool
P_PORTS_FEATURES=FLAVORS SELECTED_OPTIONS
MASTERNAME=121amd64-default-build-as-user
SCRIPTPREFIX=/usr/local/share/poudriere
OLDPWD=/poudriere/data/.m/121amd64-default-build-as-user/ref/.p
SCRIPTPATH=/usr/local/share/poudriere/bulk.sh
POUDRIEREPATH=/usr/local/bin/poudriere
---End Environment---

---Begin Poudriere Port Flags/Env---
PORT_FLAGS=
PKGENV=
FLAVOR=
DEPENDS_ARGS=
MAKE_ARGS=
---End Poudriere Port Flags/Env---

---Begin OPTIONS List---
---End OPTIONS List---

--MAINTAINER--
[hidden email]
--End MAINTAINER--

--CONFIGURE_ARGS--

--End CONFIGURE_ARGS--

--CONFIGURE_ENV--
MAKE=gmake MONO_SHARED_DIR="/wrkdirs/usr/ports/lang/fsharp/work" PKG_CONFIG=pkgconf XDG_DATA_HOME=/wrkdirs/usr/ports/lang/fsharp/work  XDG_CONFIG_HOME=/wrkdirs/usr/ports/lang/fsharp/work  HOME=/wrkdirs/usr/ports/lang/fsharp/work TMPDIR="/tmp" PATH=/wrkdirs/usr/ports/lang/fsharp/work/.bin:/sbin:/bin:/usr/sbin:/usr/bin:/usr/local/sbin:/usr/local/bin:/root/bin SHELL=/bin/sh CONFIG_SHELL=/bin/sh
--End CONFIGURE_ENV--

--MAKE_ENV--
MONO_SHARED_DIR="/wrkdirs/usr/ports/lang/fsharp/work" TZ=UTC NUGET_PACKAGES=/wrkdirs/usr/ports/lang/fsharp/work/fsharp-10.2.1/packages XDG_DATA_HOME=/wrkdirs/usr/ports/lang/fsharp/work  XDG_CONFIG_HOME=/wrkdirs/usr/ports/lang/fsharp/work  HOME=/wrkdirs/usr/ports/lang/fsharp/work TMPDIR="/tmp" PATH=/wrkdirs/usr/ports/lang/fsharp/work/.bin:/sbin:/bin:/usr/sbin:/usr/bin:/usr/local/sbin:/usr/local/bin:/root/bin NO_PIE=yes MK_DEBUG_FILES=no MK_KERNEL_SYMBOLS=no SHELL=/bin/sh NO_LINT=YES PREFIX=/usr/local  LOCALBASE=/usr/local  CC="cc" CFLAGS="-O2 -pipe  -fstack-protector-strong -fno-strict-aliasing "  CPP="cpp" CPPFLAGS=""  LDFLAGS=" -fstack-protector-strong " LIBS=""  CXX="c++" CXXFLAGS="-O2 -pipe -fstack-protector-strong -fno-strict-aliasing  "  MANPREFIX="/usr/local" BSD_INSTALL_PROGRAM="install  -s -m 555"  BSD_INSTALL_LIB="install  -s -m 0644"  BSD_INSTALL_SCRIPT="install  -m 555"  BSD_INSTALL_DATA="install  -m 0644"  BSD_INSTALL_MAN="install  -m 444"
--End MAKE_ENV--

--PLIST_SUB--
OSREL=12.1 PREFIX=%D LOCALBASE=/usr/local  RESETPREFIX=/usr/local LIB32DIR=lib DOCSDIR="share/doc/fsharp"  EXAMPLESDIR="share/examples/fsharp"  DATADIR="share/fsharp"  WWWDIR="www/fsharp"  ETCDIR="etc/fsharp"
--End PLIST_SUB--

--SUB_LIST--
PREFIX=/usr/local LOCALBASE=/usr/local  DATADIR=/usr/local/share/fsharp DOCSDIR=/usr/local/share/doc/fsharp EXAMPLESDIR=/usr/local/share/examples/fsharp  WWWDIR=/usr/local/www/fsharp ETCDIR=/usr/local/etc/fsharp
--End SUB_LIST--

---Begin make.conf---
USE_PACKAGE_DEPENDS=yes
BATCH=yes
WRKDIRPREFIX=/wrkdirs
PORTSDIR=/usr/ports
PACKAGES=/packages
DISTDIR=/distfiles
FORCE_PACKAGE=yes
PACKAGE_BUILDING=yes
PACKAGE_BUILDING_FLAVORS=yes
#### /usr/local/etc/poudriere.d/make.conf ####
# Build ALLOW_MAKE_JOBS_PACKAGES with 2 jobs
MAKE_JOBS_NUMBER=2
#### /usr/ports/Mk/Scripts/ports_env.sh ####
_CCVERSION_921dbbb2=FreeBSD clang version 8.0.1 (tags/RELEASE_801/final 366581) (based on LLVM 8.0.1) Target: x86_64-unknown-freebsd12.1 Thread model: posix InstalledDir: /usr/bin
_ALTCCVERSION_921dbbb2=none
_CXXINTERNAL_acaad9ca=FreeBSD clang version 8.0.1 (tags/RELEASE_801/final 366581) (based on LLVM 8.0.1) Target: x86_64-unknown-freebsd12.1 Thread model: posix InstalledDir: /usr/bin "/usr/bin/ld" "--eh-frame-hdr" "-dynamic-linker" "/libexec/ld-elf.so.1" "--hash-style=both" "--enable-new-dtags" "-o" "a.out" "/usr/lib/crt1.o" "/usr/lib/crti.o" "/usr/lib/crtbegin.o" "-L/usr/lib" "/dev/null" "-lc++" "-lm" "-lgcc" "--as-needed" "-lgcc_s" "--no-as-needed" "-lc" "-lgcc" "--as-needed" "-lgcc_s" "--no-as-needed" "/usr/lib/crtend.o" "/usr/lib/crtn.o"
CC_OUTPUT_921dbbb2_58173849=yes
CC_OUTPUT_921dbbb2_9bdba57c=yes
CC_OUTPUT_921dbbb2_6a4fe7f5=yes
CC_OUTPUT_921dbbb2_6bcac02b=yes
CC_OUTPUT_921dbbb2_67d20829=yes
CC_OUTPUT_921dbbb2_bfa62e83=yes
CC_OUTPUT_921dbbb2_f0b4d593=yes
CC_OUTPUT_921dbbb2_308abb44=yes
CC_OUTPUT_921dbbb2_f00456e5=yes
CC_OUTPUT_921dbbb2_65ad290d=yes
CC_OUTPUT_921dbbb2_f2776b26=yes
CC_OUTPUT_921dbbb2_b2657cc3=yes
CC_OUTPUT_921dbbb2_380987f7=yes
CC_OUTPUT_921dbbb2_160933ec=yes
CC_OUTPUT_921dbbb2_fb62803b=yes
_OBJC_CCVERSION_921dbbb2=FreeBSD clang version 8.0.1 (tags/RELEASE_801/final 366581) (based on LLVM 8.0.1) Target: x86_64-unknown-freebsd12.1 Thread model: posix InstalledDir: /usr/bin
_OBJC_ALTCCVERSION_921dbbb2=none
ARCH=amd64
OPSYS=FreeBSD
_OSRELEASE=12.1-RELEASE-p4
OSREL=12.1
OSVERSION=1201000
PYTHONBASE=/usr/local
HAVE_COMPAT_IA32_KERN=YES
CONFIGURE_MAX_CMD_LEN=524288
HAVE_PORTS_ENV=1
#### Misc Poudriere ####
DISABLE_MAKE_JOBS=poudriere
---End make.conf---
--Resource limits--
cpu time               (seconds, -t)  unlimited
file size           (512-blocks, -f)  unlimited
data seg size           (kbytes, -d)  33554432
stack size              (kbytes, -s)  524288
core file size      (512-blocks, -c)  unlimited
max memory size         (kbytes, -m)  unlimited
locked memory           (kbytes, -l)  unlimited
max user processes              (-u)  89999
open files                      (-n)  1024
virtual mem size        (kbytes, -v)  unlimited
swap limit              (kbytes, -w)  unlimited
socket buffer size       (bytes, -b)  unlimited
pseudo-terminals                (-p)  unlimited
kqueues                         (-k)  unlimited
umtx shared locks               (-o)  unlimited
--End resource limits--
=======================<phase: check-sanity   >============================
===>  License MIT accepted by the user
===========================================================================
=======================<phase: pkg-depends    >============================
===>   fsharp-10.2.1 depends on file: /usr/local/sbin/pkg - not found
===>   Installing existing package /packages/All/pkg-1.14.2.txz
[121amd64-default-build-as-user-job-06] Installing pkg-1.14.2...
[121amd64-default-build-as-user-job-06] Extracting pkg-1.14.2: .......... done
===>   fsharp-10.2.1 depends on file: /usr/local/sbin/pkg - found
===>   Returning to build of fsharp-10.2.1
===========================================================================
=======================<phase: fetch-depends  >============================
===========================================================================
=======================<phase: fetch          >============================
===>  License MIT accepted by the user
===> Fetching all distfiles required by fsharp-10.2.1 for building
===========================================================================
=======================<phase: checksum       >============================
===>  License MIT accepted by the user
===> Fetching all distfiles required by fsharp-10.2.1 for building
=> SHA256 Checksum OK for benchmarkdotnet.diagnostics.windows.0.9.8.nupkg.
=> SHA256 Checksum OK for benchmarkdotnet.0.9.8.nupkg.
=> SHA256 Checksum OK for fsharp.compiler.tools.4.1.27.nupkg.
=> SHA256 Checksum OK for fsharp.configuration.1.3.0.nupkg.
=> SHA256 Checksum OK for fsharp.core.3.0.2.nupkg.
=> SHA256 Checksum OK for fsharp.core.3.1.2.5.nupkg.
=> SHA256 Checksum OK for fsharp.core.4.0.0.1.nupkg.
=> SHA256 Checksum OK for fsharp.core.4.1.18.nupkg.
=> SHA256 Checksum OK for fsharp.data.2.2.5.nupkg.
=> SHA256 Checksum OK for fscheck.3.0.0-alpha3.nupkg.
=> SHA256 Checksum OK for fslexyacc.7.0.6.nupkg.
=> SHA256 Checksum OK for microbuild.core.0.2.0.nupkg.
=> SHA256 Checksum OK for microsoft.build.framework.14.3.0.nupkg.
=> SHA256 Checksum OK for microsoft.build.framework.15.6.85.nupkg.
=> SHA256 Checksum OK for microsoft.build.tasks.core.14.3.0.nupkg.
=> SHA256 Checksum OK for microsoft.build.tasks.core.15.6.85.nupkg.
=> SHA256 Checksum OK for microsoft.build.utilities.core.14.3.0.nupkg.
=> SHA256 Checksum OK for microsoft.build.utilities.core.15.6.85.nupkg.
=> SHA256 Checksum OK for microsoft.build.14.3.0.nupkg.
=> SHA256 Checksum OK for microsoft.build.15.6.85.nupkg.
=> SHA256 Checksum OK for microsoft.portable.fsharp.core.10.1.0.nupkg.
=> SHA256 Checksum OK for nunit.console.3.0.0.nupkg.
=> SHA256 Checksum OK for nunit3testadapter.3.0.8-ctp-8.nupkg.
=> SHA256 Checksum OK for nunit.3.5.0.nupkg.
=> SHA256 Checksum OK for nunitlite.3.5.0.nupkg.
=> SHA256 Checksum OK for system.collections.immutable.1.5.0.nupkg.
=> SHA256 Checksum OK for system.io.compression.4.3.0.nupkg.
=> SHA256 Checksum OK for system.reflection.metadata.1.6.0.nupkg.
=> SHA256 Checksum OK for system.valuetuple.4.4.0.nupkg.
=> SHA256 Checksum OK for fsharp-fsharp-10.2.1_GH0.tar.gz.
===========================================================================
=======================<phase: extract-depends>============================
===========================================================================
=======================<phase: extract        >============================
===>  License MIT accepted by the user
===> Fetching all distfiles required by fsharp-10.2.1 for building
===>  Extracting for fsharp-10.2.1
=> SHA256 Checksum OK for benchmarkdotnet.diagnostics.windows.0.9.8.nupkg.
=> SHA256 Checksum OK for benchmarkdotnet.0.9.8.nupkg.
=> SHA256 Checksum OK for fsharp.compiler.tools.4.1.27.nupkg.
<snip>
  -r:/usr/local/lib/mono/4.6-api/Facades/System.Runtime.InteropServices.dll
  -r:/usr/local/lib/mono/4.6-api/Facades/System.Runtime.InteropServices.WindowsRuntime.dll
  -r:/usr/local/lib/mono/4.6-api/Facades/System.Runtime.Numerics.dll
  -r:/usr/local/lib/mono/4.6-api/Facades/System.Runtime.Serialization.Json.dll
  -r:/usr/local/lib/mono/4.6-api/Facades/System.Runtime.Serialization.Primitives.dll
  -r:/usr/local/lib/mono/4.6-api/Facades/System.Runtime.Serialization.Xml.dll
  -r:/usr/local/lib/mono/4.6-api/Facades/System.Security.Principal.dll
  -r:/usr/local/lib/mono/4.6-api/Facades/System.ServiceModel.Duplex.dll
  -r:/usr/local/lib/mono/4.6-api/Facades/System.ServiceModel.Http.dll
  -r:/usr/local/lib/mono/4.6-api/Facades/System.ServiceModel.NetTcp.dll
  -r:/usr/local/lib/mono/4.6-api/Facades/System.ServiceModel.Primitives.dll
  -r:/usr/local/lib/mono/4.6-api/Facades/System.ServiceModel.Security.dll
  -r:/usr/local/lib/mono/4.6-api/Facades/System.Text.Encoding.dll
  -r:/usr/local/lib/mono/4.6-api/Facades/System.Text.Encoding.Extensions.dll
  -r:/usr/local/lib/mono/4.6-api/Facades/System.Text.RegularExpressions.dll
  -r:/usr/local/lib/mono/4.6-api/Facades/System.Threading.dll
  -r:/usr/local/lib/mono/4.6-api/Facades/System.Threading.Tasks.dll
  -r:/usr/local/lib/mono/4.6-api/Facades/System.Threading.Tasks.Parallel.dll
  -r:/usr/local/lib/mono/4.6-api/Facades/System.Threading.Timer.dll
  -r:/usr/local/lib/mono/4.6-api/Facades/System.Xml.ReaderWriter.dll
  -r:/usr/local/lib/mono/4.6-api/Facades/System.Xml.XDocument.dll
  -r:/usr/local/lib/mono/4.6-api/Facades/System.Xml.XmlSerializer.dll
  --target:exe
  --nowarn:69,65,54,61,75,62,35,44,62,9,60,86,47,1203
  --warn:3
  --warnaserror
  --warnaserror:76
  --fullpaths
  --flaterrors
  --subsystemversion:6.00
  --highentropyva+
  --times
  --warnon:1182
  --stackReserveSize:4096000
  --version:4.5.0.0
  obj/Proto/net40/FSComp.fs
  /tmp/.NETFramework,Version=v4.6.AssemblyAttributes.fs
  ../Logger.fsi
  ../Logger.fs
  ../../utils/reshapedreflection.fs
  ../../utils/sformat.fsi
  ../../utils/sformat.fs
  ../sr.fsi
  ../sr.fs
  ../../utils/prim-lexing.fsi
  ../../utils/prim-lexing.fs
  ../../utils/prim-parsing.fsi
  ../../utils/prim-parsing.fs
  ../../utils/ResizeArray.fsi
  ../../utils/ResizeArray.fs
  ../../utils/HashMultiMap.fsi
  ../../utils/HashMultiMap.fs
  ../../utils/EditDistance.fs
  ../../utils/TaggedCollections.fsi
  ../../utils/TaggedCollections.fs
  ../../absil/ildiag.fsi
  ../../absil/ildiag.fs
  ../../absil/illib.fs
  ../../utils/filename.fsi
  ../../utils/filename.fs
  ../../absil/zmap.fsi
  ../../absil/zmap.fs
  ../../absil/zset.fsi
  ../../absil/zset.fs
  ../../absil/bytes.fsi
  ../../absil/bytes.fs
  ../ReferenceResolver.fs
  ../../absil/il.fsi
  ../../absil/il.fs
  ../../absil/ilx.fsi
  ../../absil/ilx.fs
  ../../absil/ilascii.fsi
  ../../absil/ilascii.fs
  ../../absil/ilprint.fsi
  ../../absil/ilprint.fs
  ../../absil/ilmorph.fsi
  ../../absil/ilmorph.fs
  ../../absil/ilsupp.fsi
  ../../absil/ilsupp.fs
  ilpars.fs
  illex.fs
  ../../absil/ilbinary.fsi
  ../../absil/ilbinary.fs
  ../lib.fs
  ../range.fsi
  ../range.fs
  ../rational.fsi
  ../rational.fs
  ../ErrorLogger.fs
  ../ErrorResolutionHints.fs
  ../InternalCollections.fsi
  ../InternalCollections.fs
  ../../absil/ilread.fsi
  ../../absil/ilread.fs
  ../../absil/ilwrite.fsi
  ../../absil/ilwritepdb.fsi
  ../../absil/ilwritepdb.fs
  ../../absil/ilwrite.fs
  ../../absil/ilreflect.fs
  ../../utils/CompilerLocationUtils.fs
  ../PrettyNaming.fs
  ../../ilx/ilxsettings.fs
  ../../ilx/EraseClosures.fsi
  ../../ilx/EraseClosures.fs
  ../../ilx/EraseUnions.fsi
  ../../ilx/EraseUnions.fs
  ../UnicodeLexing.fsi
  ../UnicodeLexing.fs
  ../layout.fsi
  ../layout.fs
  ../ast.fs
  pppars.fs
  pars.fs
  ../lexhelp.fsi
  ../lexhelp.fs
  pplex.fs
  lex.fs
  ../QuotationPickler.fsi
  ../QuotationPickler.fs
  ../QueueList.fs
  ../tast.fs
  ../TcGlobals.fs
  ../TastOps.fsi
  ../TastOps.fs
  ../TastPickle.fsi
  ../TastPickle.fs
  ../LexFilter.fs
  ../import.fsi
  ../import.fs
  ../infos.fs
  ../AccessibilityLogic.fs
  ../AttributeChecking.fs
  ../InfoReader.fs
  ../NicePrint.fs
  ../AugmentWithHashCompare.fsi
  ../AugmentWithHashCompare.fs
  ../NameResolution.fsi
  ../NameResolution.fs
  ../TypeRelations.fs
  ../SignatureConformance.fs
  ../MethodOverrides.fs
  ../MethodCalls.fs
  ../PatternMatchCompilation.fsi
  ../PatternMatchCompilation.fs
  ../ConstraintSolver.fsi
  ../ConstraintSolver.fs
  ../CheckFormatStrings.fsi
  ../CheckFormatStrings.fs
  ../FindUnsolved.fs
  ../QuotationTranslator.fsi
  ../QuotationTranslator.fs
  ../PostInferenceChecks.fsi
  ../PostInferenceChecks.fs
  ../TypeChecker.fsi
  ../TypeChecker.fs
  ../Optimizer.fsi
  ../Optimizer.fs
  ../autobox.fs
  ../DetupleArgs.fsi
  ../DetupleArgs.fs
  ../InnerLambdasToTopLevelFuncs.fsi
  ../InnerLambdasToTopLevelFuncs.fs
  ../LowerCallsAndSeqs.fs
  ../IlxGen.fsi
  ../IlxGen.fs
  ../CompileOps.fsi
  ../CompileOps.fs
  ../CompileOptions.fsi
  ../CompileOptions.fs
  ../fsc.fsi
  ../fsc.fs
  ../SimulatedMSBuildReferenceResolver.fs
  ../fscmain.fs
 
/wrkdirs/usr/ports/lang/fsharp/work/fsharp-10.2.1/packages/FSharp.Compiler.Tools.4.1.27/tools/Microsoft.FSharp.Targets(262,9): error MSB6006: "fsc.exe" exited with code 137. [/wrkdirs/usr/ports/lang/fsharp/work/fsharp-10.2.1/src/fsharp/Fsc-proto/Fsc-proto.fsproj]
Done Building Project "/wrkdirs/usr/ports/lang/fsharp/work/fsharp-10.2.1/src/fsharp/Fsc-proto/Fsc-proto.fsproj" (default targets) -- FAILED.

Build FAILED.

"/wrkdirs/usr/ports/lang/fsharp/work/fsharp-10.2.1/src/fsharp/Fsc-proto/Fsc-proto.fsproj" (default target) (1) ->
(ResolveAssemblyReferences target) ->
  /usr/local/lib/mono/msbuild/15.0/bin/Microsoft.Common.CurrentVersion.targets(2126,5): warning MSB3245: Could not resolve this reference. Could not locate the assembly "ISymWrapper, Version=4.0.0.0, Culture=neutral, PublicKeyToken=b03f5f7f11d50a3a". Check to make sure the assembly exists on disk. If this reference is required by your code, you may get compilation errors. [/wrkdirs/usr/ports/lang/fsharp/work/fsharp-10.2.1/src/fsharp/Fsc-proto/Fsc-proto.fsproj]


"/wrkdirs/usr/ports/lang/fsharp/work/fsharp-10.2.1/src/fsharp/Fsc-proto/Fsc-proto.fsproj" (default target) (1) ->
(CoreCompile target) ->
  /wrkdirs/usr/ports/lang/fsharp/work/fsharp-10.2.1/packages/FSharp.Compiler.Tools.4.1.27/tools/Microsoft.FSharp.Targets(262,9): error MSB6006: "fsc.exe" exited with code 137. [/wrkdirs/usr/ports/lang/fsharp/work/fsharp-10.2.1/src/fsharp/Fsc-proto/Fsc-proto.fsproj]

    1 Warning(s)
    1 Error(s)

Time Elapsed 00:02:25.15
gmake[2]: *** [Makefile:29: build-proto] Error 1
gmake[2]: Leaving directory '/wrkdirs/usr/ports/lang/fsharp/work/fsharp-10.2.1'
gmake[1]: *** [Makefile:24: all] Error 2
gmake[1]: Leaving directory '/wrkdirs/usr/ports/lang/fsharp/work/fsharp-10.2.1'
*** Error code 1

Stop.
make: stopped in /usr/ports/lang/fsharp
_______________________________________________
[hidden email] mailing list
https://lists.freebsd.org/mailman/listinfo/freebsd-mono
To unsubscribe, send any mail to "[hidden email]"