freebsd-toolchain

This forum is an archive for the mailing list freebsd-toolchain@freebsd.org (more options) Messages posted here will be sent to this mailing list.
This is the mailing list for discussions related to the maintenance of the toolchain that is shipped with FreeBSD. This could include the state of Clang and GCC, but also pieces of software such as assemblers, linkers and debuggers.
1234 ... 10
Topics (847)
Replies Last Post Views
[Bug 219484] cad/openvsp: Fails to build with lang/gcc6 or later on 10.3 (< 11.0) by bugzilla-noreply
0
by bugzilla-noreply
Re: [package - head-amd64-default][games/simutrans] Failed for simutrans-120.2.2 in build by Tijl Coosemans-4
0
by Tijl Coosemans-4
[Bug 218808] www/firefox: usr/bin/ld: error: unknown argument: --warn-unresolved-symbols (WITH_LLD_IS_LD) by bugzilla-noreply
0
by bugzilla-noreply
[Bug 219484] cad/openvsp: Fails to build with lang/gcc6 or later on 10.3 (< 11.0) by bugzilla-noreply
0
by bugzilla-noreply
[Bug 219484] cad/openvsp: Fails to build with lang/gcc6 or later on 10.3 (< 11.0) by bugzilla-noreply
0
by bugzilla-noreply
[Bug 219484] cad/openvsp: Fails to build with lang/gcc6 or later on 10.3 (< 11.0) by bugzilla-noreply
0
by bugzilla-noreply
[Bug 218808] www/firefox: usr/bin/ld: error: unknown argument: --warn-unresolved-symbols by bugzilla-noreply
0
by bugzilla-noreply
[Bug 219484] cad/openvsp: Fails to build with lang/gcc6 or later on 10.3 (< 11.0) by bugzilla-noreply
0
by bugzilla-noreply
head -r320458 (e.g.) amd64 -> powerpc64 cross build's install32 during installworld: /usr/src/share/mk/bsd.linker.mk tried to use "head" when PATH provided no access (head is missing) by Mark Millard-2
2
by Bryan Drewery-6
[Bug 219484] cad/openvsp: Fails to build with lang/gcc6 or later on 10.3 (< 11.0) by bugzilla-noreply
0
by bugzilla-noreply
Re: -r321371 amd64 -> powerpc64 cross build: lldb.full link fails with: c++: error: linker command failed with exit code 1, -B/usr/local/powerpc64-freebsd/bin/ in use by Mark Millard-2
4
by Mark Millard-2
[Bug 219484] cad/openvsp: Fails to build with lang/gcc6 or later on 10.3 (< 11.0) by bugzilla-noreply
0
by bugzilla-noreply
[Bug 219484] cad/openvsp: fails to build with lang/gcc6 or later on 10.3 by bugzilla-noreply
0
by bugzilla-noreply
[Bug 219484] cad/openvsp: fails to build with lang/gcc6 or later on 10.3 by bugzilla-noreply
0
by bugzilla-noreply
-r321371: -j8 failed for "installworld distrib-dirs distribute DESTDIR=/usr/obj/DESTDIRs/clang-amd64-installworld-dist" by Mark Millard-2
3
by Bryan Drewery-6
[Bug 219484] cad/openvsp: fails to build with lang/gcc6 or later on 10.3 by bugzilla-noreply
0
by bugzilla-noreply
[Bug 219484] cad/openvsp: fails to build with lang/gcc6 or later on 10.3 by bugzilla-noreply
0
by bugzilla-noreply
FWD: libstdc++ build failures on MIPS, PowerPC, Sparc by Mark Millard-2
3
by Mark Millard-2
amd64 -r321109 -> -r321371 buildworld update failed (spans clang 5 update); error: too few arguments provided to function-like macro invocation; , METAMODE and -j8 was used by Mark Millard-2
5
by Mark Millard-2
Problem reports for freebsd-toolchain@FreeBSD.org that need special attention by bugzilla-noreply
0
by bugzilla-noreply
-r321371: "installworld distrib-dirs distribute DESTDIR=/usr/obj/DESTDIRs/clang-amd64-installworld-dist" failed: target directory `/base/usr/lib/' does not exist by Mark Millard-2
0
by Mark Millard-2
A powerpc64 clang 4 vs. clang 5 patch difference for PltRel and GotRel for ELF by Mark Millard-2
0
by Mark Millard-2
[Bug 218808] www/firefox: usr/bin/ld: error: unknown argument: --warn-unresolved-symbols by bugzilla-noreply
0
by bugzilla-noreply
[Bug 220883] clang crash: Assertion failed: (Result.isUninit() && "temporary created multiple times"), function createTemporary by bugzilla-noreply
0
by bugzilla-noreply
[Bug 220883] clang crash: Assertion failed: (Result.isUninit() && "temporary created multiple times"), function createTemporary by bugzilla-noreply
0
by bugzilla-noreply
[Bug 219484] cad/openvsp: fails to build with lang/gcc6 or later on 10.3 by bugzilla-noreply
0
by bugzilla-noreply
Fwd: Re: [VirtualBox-5.1.22 Build Failed on FreeBSD-12] by Jung-uk Kim
1
by mm
[Bug 219484] cad/openvsp: fails to build with lang/gcc6 or later on 10.3 by bugzilla-noreply
0
by bugzilla-noreply
Re: lang/gcc6-aux for head beyond __nonnull related issues: vm_ooffset_t and vm_pindex_t related changes (and more) by Mark Millard-2
12
by Konstantin Belousov
[Bug 219484] cad/openvsp: fails to build with lang/gcc6 or later on 10.* by bugzilla-noreply
0
by bugzilla-noreply
[Bug 219484] cad/openvsp: fails to build with lang/gcc6 or later on 10.* by bugzilla-noreply
0
by bugzilla-noreply
[Bug 219484] cad/openvsp: fails to build with lang/gcc6 or later on 10.* by bugzilla-noreply
0
by bugzilla-noreply
Re: suggestion for toolchain to have its own directories by Sid
2
by Sid
[Bug 219484] cad/openvsp: fails to build with lang/gcc6 or later on 10.* by bugzilla-noreply
0
by bugzilla-noreply
Re: Look for a committer by Kurt Jaeger-14
1
by Jov-2
[Bug 219484] cad/openvsp: fails to build with lang/gcc6 or later on 10.* by bugzilla-noreply
0
by bugzilla-noreply
maintainer-feedback requested: [Bug 219484] cad/openvsp: fails to build with lang/gcc6 or later on 10.* by bugzilla-noreply
0
by bugzilla-noreply
Duplicate OPT_ entries in gcc/options.h by Gerald Pfeifer
9
by Gerald Pfeifer
[Bug 220590] math/fftw3: fails to build on armv6 (729 ports skipped) by bugzilla-noreply
11
by bugzilla-noreply
[Bug 220591] graphics/graphviz: fails to build on armv6 (451 ports skipped) by bugzilla-noreply
8
by bugzilla-noreply
[Bug 218808] www/firefox: usr/bin/ld: error: unknown argument: --warn-unresolved-symbols by bugzilla-noreply
0
by bugzilla-noreply
system clang on powerpc64 vs building lang/gcc7-devel with it: xgcc gets segmentation fault by Mark Millard-2
0
by Mark Millard-2
June 2017 update on using LLVM's lld linker in the FreeBSD base system by Ed Maste-2
1
by Ed Maste-2
Re: lang/gcc* package builds vs. release/11.0.1/ and the future release/11.1.0 because of vm_ooffset_t and vm_pindex_t changes and how the lang/gcc* work by Gerald Pfeifer
4
by Gerald Pfeifer
head -r320570 (e.g.): ld crashes on powerpc64. . . (this was during port builds, I got about 65 of them) by Mark Millard-2
0
by Mark Millard-2
suggestion for toolchain to have its own directories by Sid
3
by Sid
Re: head -r320458 (e.g.) amd64 -> powerpc (32-bit) cross-buildworld fails for time libc++ static_asserts and overflow/underflow of long long (system clang/clang++ 4 based build) by Mark Millard-2
2
by Dimitry Andric-4
/usr/ports -r444615 (e.g.) & head -r320458 (e.g.): sysutils/u-boot-pine64 build fails for arch/arm/dts/pine64_plus.dtb source handling error (gic in a64.dtsi) by Mark Millard-2
0
by Mark Millard-2
Recent reports of needing to avoid META_MODE for head kernel builds for updates: a preliminary investigation by Mark Millard-2
0
by Mark Millard-2
head -r320192 -> -r320387 kernel build and install to a DESTDIR: if_igb.ko vs. DESTDIR use for installkernel has symbolic link that seems inapproriate by Mark Millard-2
0
by Mark Millard-2
[Bug 220184] clang 4.0.0 segfaults on buildworld by bugzilla-noreply
0
by bugzilla-noreply
[Bug 220184] clang 4.0.0 segfaults on buildworld by bugzilla-noreply
0
by bugzilla-noreply
[Bug 220184] clang 4.0.0 segfaults on buildworld by bugzilla-noreply
0
by bugzilla-noreply
[Bug 220184] clang 4.0.0 segfaults on buildworld by bugzilla-noreply
0
by bugzilla-noreply
[Bug 220184] clang 4.0.0 segfaults on buildworld by bugzilla-noreply
0
by bugzilla-noreply
[Bug 220233] Clang: Assertion failed: (NextLocalOffset + FileSize + 1 > NextLocalOffset && NextLocalOffset + FileSize + 1 <= CurrentLoadedOffset && "Ran out of source locations!") by bugzilla-noreply
0
by bugzilla-noreply
[Bug 220233] Clang: Assertion failed: (NextLocalOffset + FileSize + 1 > NextLocalOffset && NextLocalOffset + FileSize + 1 <= CurrentLoadedOffset && "Ran out of source locations!") by bugzilla-noreply
0
by bugzilla-noreply
[Bug 220184] clang 4.0.0 segfaults on buildworld by bugzilla-noreply
0
by bugzilla-noreply
[Bug 220184] clang 4.0.0 segfaults on buildworld by bugzilla-noreply
0
by bugzilla-noreply
[Bug 220184] clang 4.0.0 segfaults on buildworld by bugzilla-noreply
0
by bugzilla-noreply
[Bug 220184] clang 4.0.0 segfaults on buildworld by bugzilla-noreply
0
by bugzilla-noreply
[Bug 220184] clang 4.0.0 segfaults on buildworld by bugzilla-noreply
0
by bugzilla-noreply
[Bug 220184] clang 4.0.0 segfaults on buildworld by bugzilla-noreply
0
by bugzilla-noreply
[Bug 220184] clang 4.0.0 segfaults on buildworld by bugzilla-noreply
0
by bugzilla-noreply
[Bug 220184] clang 4.0.0 segfaults on buildworld by bugzilla-noreply
0
by bugzilla-noreply
[Bug 220184] clang 4.0.0 segfaults on buildworld by bugzilla-noreply
0
by bugzilla-noreply
[Bug 220184] clang 4.0.0 segfaults on buildworld by bugzilla-noreply
0
by bugzilla-noreply
[Bug 220184] clang 4.0.0 segfaults on buildworld by bugzilla-noreply
0
by bugzilla-noreply
Re: head -r320192 vs. devel/aarch64-xtoolchain-gcc and devel/aarch64-binutils (/usr/ports -r443557): "liblto_plugin.so: error loading plugin: Service unavailable" for .pico link by Mark Millard-2
0
by Mark Millard-2
[Bug 220024] head -r319991 clang powerpc64 and powerpc toolchains (cross build target): boot1.o: In function `fsread_size': undefined reference to `__udivdi3' (INO64 involved) by bugzilla-noreply
0
by bugzilla-noreply
Re: arm64 on head -r320059 (e.g.) fails buildkernel with only kernel-toolchain first (not buildworld) [Bugzilla 220125] by Mark Millard-2
2
by Dimitry Andric-4
[Bug 218808] www/firefox: usr/bin/ld: error: unknown argument: --warn-unresolved-symbols by bugzilla-noreply
0
by bugzilla-noreply
[Bug 220024] head -r319991 clang powerpc64 and powerpc toolchains (cross build target): boot1.o: In function `fsread_size': undefined reference to `__udivdi3' (INO64 involved) by bugzilla-noreply
0
by bugzilla-noreply
[Bug 220024] head -r319991 clang powerpc64 and powerpc toolchains (cross build target): boot1.o: In function `fsread_size': undefined reference to `__udivdi3' (INO64 involved) by bugzilla-noreply
0
by bugzilla-noreply
[Bug 220024] head -r319991 clang powerpc64 and powerpc toolchains (cross build target): boot1.o: In function `fsread_size': undefined reference to `__udivdi3' (INO64 involved) by bugzilla-noreply
0
by bugzilla-noreply
[Bug 220024] head -r319991 clang powerpc64 and powerpc toolchains (cross build target): boot1.o: In function `fsread_size': undefined reference to `__udivdi3' (INO64 involved) by bugzilla-noreply
0
by bugzilla-noreply
-r319991 buildkernel waiting in sed for terminal input (the buildworld part completes first), amd64->powerpc cross build by Mark Millard-2
3
by Mark Millard-2
Re: -r319936 and -r319991 TARGET_ARCH=powerpc via clang: boot1.chrp/boot1.c:(.text+0x14b8): undefined reference to `__udivdi3' (boot1.o: In function `fsread_size') by Mark Millard-2
1
by Mark Millard-2
Re: Function attribute for optimization level by Konstantin Belousov
3
by David Chisnall-2
[Bug 219589] head -r317820 (e.g.); stable/11: TARGET_ARCH=powerpc needs a (somewhat dynamic) variant of powerpc64's 205458 fix if PowerMac G5's are to be supported by bugzilla-noreply
0
by bugzilla-noreply
[Bug 219589] head -r317820 (e.g.); stable/11: TARGET_ARCH=powerpc needs a (somewhat dynamic) variant of powerpc64's 205458 fix if PowerMac G5's are to be supported by bugzilla-noreply
0
by bugzilla-noreply
[Bug 219589] head -r317820 (e.g.); stable/11: TARGET_ARCH=powerpc needs a (somewhat dynamic) variant of powerpc64's 205458 fix if PowerMac G5's are to be supported by bugzilla-noreply
0
by bugzilla-noreply
[Bug 219289] security/clambc: fails to build with lang/gcc6 or later by bugzilla-noreply
6
by bugzilla-noreply
llvm FreeBSD powerpc ABI target bug fix: Re: [Bug 26519] Clang 4.0.0's "Target: powerpc-unknown-freebsd11.0" code generation is violating the SVR4 ABI (SEGV can result) by Mark Millard-2
6
by Dimitry Andric-4
Re: PowerPC64 C++ exceptions with clang/llvm by Mark Millard-2
0
by Mark Millard-2
cpp behavior? by Steve Kargl
2
by Steve Kargl
[Bug 218808] www/firefox: usr/bin/ld: error: unknown argument: --warn-unresolved-symbols by bugzilla-noreply
0
by bugzilla-noreply
[Bug 219153] head, stable/11, release/11.0.1: libkvm (& more?) not updated to handle powerpc/powerpc64 ET_DYN based vmcore.* 's and such by bugzilla-noreply
0
by bugzilla-noreply
[Bug 216080] science/bddsolve: fails to build with lang/gcc6 or later by bugzilla-noreply
0
by bugzilla-noreply
[Bug 216080] science/bddsolve: fails to build with lang/gcc6 or later by bugzilla-noreply
0
by bugzilla-noreply
1234 ... 10