[package - 120amd64-quarterly][devel/monodevelop] Failed for monodevelop-7.6.3.1 in build

classic Classic list List threaded Threaded
1 message Options
Reply | Threaded
Open this post in threaded view
|

[package - 120amd64-quarterly][devel/monodevelop] Failed for monodevelop-7.6.3.1 in build

pkg-fallout
You are receiving this mail as a port that you maintain
is failing to build on the FreeBSD package build server.
Please investigate the failure and submit a PR to fix
build.

Maintainer:     [hidden email]
Last committer: [hidden email]
Ident:          $FreeBSD: branches/2018Q4/devel/monodevelop/Makefile 479269 2018-09-09 06:22:42Z dbn $
Log URL:        http://beefy2.nyi.freebsd.org/data/120amd64-quarterly/486733/logs/monodevelop-7.6.3.1.log
Build URL:      http://beefy2.nyi.freebsd.org/build.html?mastername=120amd64-quarterly&build=486733
Log:

=>> Building devel/monodevelop
build started at Thu Dec  6 01:45:46 UTC 2018
port directory: /usr/ports/devel/monodevelop
package name: monodevelop-7.6.3.1
building for: FreeBSD 120amd64-quarterly-job-15 12.0-RC3 FreeBSD 12.0-RC3 1200086 amd64
maintained by: [hidden email]
Makefile ident:      $FreeBSD: branches/2018Q4/devel/monodevelop/Makefile 479269 2018-09-09 06:22:42Z dbn $
Poudriere version: 3.2.8
Host OSVERSION: 1300002
Jail OSVERSION: 1200086
Job Id: 15

---Begin Environment---
SHELL=/bin/csh
OSVERSION=1200086
UNAME_v=FreeBSD 12.0-RC3 1200086
UNAME_r=12.0-RC3
BLOCKSIZE=K
MAIL=/var/mail/root
STATUS=1
HOME=/root
PATH=/sbin:/bin:/usr/sbin:/usr/bin:/usr/local/sbin:/usr/local/bin:/root/bin
LOCALBASE=/usr/local
USER=root
LIBEXECPREFIX=/usr/local/libexec/poudriere
POUDRIERE_VERSION=3.2.8
MASTERMNT=/usr/local/poudriere/data/.m/120amd64-quarterly/ref
POUDRIERE_BUILD_TYPE=bulk
PACKAGE_BUILDING=yes
SAVED_TERM=
PWD=/usr/local/poudriere/data/.m/120amd64-quarterly/ref/.p/pool
P_PORTS_FEATURES=FLAVORS SELECTED_OPTIONS
MASTERNAME=120amd64-quarterly
SCRIPTPREFIX=/usr/local/share/poudriere
OLDPWD=/usr/local/poudriere/data/.m/120amd64-quarterly/ref/.p
SCRIPTPATH=/usr/local/share/poudriere/bulk.sh
POUDRIEREPATH=/usr/local/bin/poudriere
---End Environment---

---Begin Poudriere Port Flags/Env---
PORT_FLAGS=
PKGENV=
FLAVOR=
DEPENDS_ARGS=
MAKE_ARGS=
---End Poudriere Port Flags/Env---

---Begin OPTIONS List---
---End OPTIONS List---

--MAINTAINER--
[hidden email]
--End MAINTAINER--

--CONFIGURE_ARGS--
--enable-release --disable-update-mimedb --disable-update-desktopdb  --enable-maintainer-mode --enable-gnomeplatform --enable-git --prefix=/usr/local ${_LATE_CONFIGURE_ARGS}
--End CONFIGURE_ARGS--

--CONFIGURE_ENV--
MAKE=gmake MONO_SHARED_DIR="/wrkdirs/usr/ports/devel/monodevelop/work" PKG_CONFIG=pkgconf XDG_DATA_HOME=/wrkdirs/usr/ports/devel/monodevelop/work  XDG_CONFIG_HOME=/wrkdirs/usr/ports/devel/monodevelop/work  HOME=/wrkdirs/usr/ports/devel/monodevelop/work TMPDIR="/tmp" PATH=/wrkdirs/usr/ports/devel/monodevelop/work/.bin:/sbin:/bin:/usr/sbin:/usr/bin:/usr/local/sbin:/usr/local/bin:/root/bin SHELL=/bin/sh CONFIG_SHELL=/bin/sh LANG=en_US.UTF-8 LC_ALL=en_US.UTF-8 CONFIG_SITE=/usr/ports/Templates/config.site lt_cv_sys_max_cmd_len=262144
--End CONFIGURE_ENV--

--MAKE_ENV--
DOTNET_MSBUILD_SDK_RESOLVER_SDKS_DIR=  XDG_CACHE_HOME=/wrkdirs/usr/ports/devel/monodevelop/work MONO_SHARED_DIR="/wrkdirs/usr/ports/devel/monodevelop/work" TZ=UTC NUGET_PACKAGES=/wrkdirs/usr/ports/devel/monodevelop/work/monodevelop-6594701/main/packages OPENSSLBASE=/usr OPENSSLDIR=/etc/ssl OPENSSLINC=/usr/include OPENSSLLIB=/usr/lib XDG_DATA_HOME=/wrkdirs/usr/ports/devel/monodevelop/work  XDG_CONFIG_HOME=/wrkdirs/usr/ports/devel/monodevelop/work  HOME=/wrkdirs/usr/ports/devel/monodevelop/work TMPDIR="/tmp" PATH=/wrkdirs/usr/ports/devel/monodevelop/work/.bin:/sbin:/bin:/usr/sbin:/usr/bin:/usr/local/sbin:/usr/local/bin:/root/bin NO_PIE=yes MK_DEBUG_FILES=no MK_KERNEL_SYMBOLS=no SHELL=/bin/sh NO_LINT=YES LANG=en_US.UTF-8 LC_ALL=en_US.UTF-8 PREFIX=/usr/local  LOCALBASE=/usr/local  CC="cc" CFLAGS="-O2 -pipe  -fstack-protector -fno-strict-aliasing "  CPP="cpp" CPPFLAGS=""  LDFLAGS="  -fstack-protector " LIBS=""  CXX="c++" CXXFLAGS="-O2 -pipe -fstack-protector -fno-strict-aliasing  "  MANPR
 EFIX="/usr/local" BSD_INSTALL_PROGRAM="/usr/bin/install  -s -m 555"  BSD_INSTALL_LIB="/usr/bin/install  -s -m 0644"  BSD_INSTALL_SCRIPT="/usr/bin/install  -m 555"  BSD_INSTALL_DATA="/usr/bin/install  -m 0644"  BSD_INSTALL_MAN="/usr/bin/install  -m 444"
--End MAKE_ENV--

--PLIST_SUB--
GTK2_VERSION="2.10.0"  GTK3_VERSION="3.0.0" OSREL=12.0 PREFIX=%D LOCALBASE=/usr/local  RESETPREFIX=/usr/local LIB32DIR=lib DOCSDIR="share/doc/monodevelop"  EXAMPLESDIR="share/examples/monodevelop"  DATADIR="share/monodevelop"  WWWDIR="www/monodevelop"  ETCDIR="etc/monodevelop"
--End PLIST_SUB--

--SUB_LIST--
PREFIX=/usr/local LOCALBASE=/usr/local  DATADIR=/usr/local/share/monodevelop DOCSDIR=/usr/local/share/doc/monodevelop EXAMPLESDIR=/usr/local/share/examples/monodevelop  WWWDIR=/usr/local/www/monodevelop ETCDIR=/usr/local/etc/monodevelop
--End SUB_LIST--

---Begin make.conf---
USE_PACKAGE_DEPENDS=yes
BATCH=yes
WRKDIRPREFIX=/wrkdirs
PORTSDIR=/usr/ports
PACKAGES=/packages
DISTDIR=/distfiles
PACKAGE_BUILDING=yes
PACKAGE_BUILDING_FLAVORS=yes
#### /usr/local/etc/poudriere.d/make.conf ####
# XXX: We really need this but cannot use it while 'make checksum' does not
# try the next mirror on checksum failure.  It currently retries the same
# failed mirror and then fails rather then trying another.  It *does*
# try the next if the size is mismatched though.
#MASTER_SITE_FREEBSD=yes
# Build ALLOW_MAKE_JOBS_PACKAGES with 2 jobs
MAKE_JOBS_NUMBER=2

# stable/10 includes src.conf too late but make.conf is in sys.mk
.if ${.CURDIR:M/poudriere/jails/10*/usr/src/usr.bin/xlint*}
# Disable build of llib now that head no longer has lint(1)
LINT= true
.endif
#### /usr/ports/Mk/Scripts/ports_env.sh ####
_CCVERSION_921dbbb2=FreeBSD clang version 6.0.1 (tags/RELEASE_601/final 335540) (based on LLVM 6.0.1) Target: x86_64-unknown-freebsd12.0 Thread model: posix InstalledDir: /usr/bin
_ALTCCVERSION_921dbbb2=none
_CXXINTERNAL_acaad9ca=FreeBSD clang version 6.0.1 (tags/RELEASE_601/final 335540) (based on LLVM 6.0.1) Target: x86_64-unknown-freebsd12.0 Thread model: posix InstalledDir: /usr/bin "/usr/bin/ld" "--eh-frame-hdr" "-dynamic-linker" "/libexec/ld-elf.so.1" "--hash-style=both" "--enable-new-dtags" "-o" "a.out" "/usr/lib/crt1.o" "/usr/lib/crti.o" "/usr/lib/crtbegin.o" "-L/usr/lib" "/dev/null" "-lc++" "-lm" "-lgcc" "--as-needed" "-lgcc_s" "--no-as-needed" "-lc" "-lgcc" "--as-needed" "-lgcc_s" "--no-as-needed" "/usr/lib/crtend.o" "/usr/lib/crtn.o"
CC_OUTPUT_921dbbb2_58173849=yes
CC_OUTPUT_921dbbb2_9bdba57c=yes
CC_OUTPUT_921dbbb2_6a4fe7f5=yes
CC_OUTPUT_921dbbb2_6bcac02b=yes
CC_OUTPUT_921dbbb2_67d20829=yes
CC_OUTPUT_921dbbb2_bfa62e83=yes
CC_OUTPUT_921dbbb2_f0b4d593=yes
CC_OUTPUT_921dbbb2_308abb44=yes
CC_OUTPUT_921dbbb2_f00456e5=yes
CC_OUTPUT_921dbbb2_65ad290d=yes
CC_OUTPUT_921dbbb2_f2776b26=yes
CC_OUTPUT_921dbbb2_b2657cc3=yes
CC_OUTPUT_921dbbb2_380987f7=yes
CC_OUTPUT_921dbbb2_160933ec=yes
CC_OUTPUT_921dbbb2_fb62803b=yes
_OBJC_CCVERSION_921dbbb2=FreeBSD clang version 6.0.1 (tags/RELEASE_601/final 335540) (based on LLVM 6.0.1) Target: x86_64-unknown-freebsd12.0 Thread model: posix InstalledDir: /usr/bin
_OBJC_ALTCCVERSION_921dbbb2=none
ARCH=amd64
OPSYS=FreeBSD
_OSRELEASE=12.0-RC3
OSREL=12.0
OSVERSION=1200086
PYTHONBASE=/usr/local
HAVE_COMPAT_IA32_KERN=YES
CONFIGURE_MAX_CMD_LEN=262144
HAVE_PORTS_ENV=1
#### Misc Poudriere ####
GID=0
UID=0
DISABLE_MAKE_JOBS=poudriere
---End make.conf---
--Resource limits--
cpu time               (seconds, -t)  unlimited
file size           (512-blocks, -f)  unlimited
data seg size           (kbytes, -d)  33554432
stack size              (kbytes, -s)  524288
core file size      (512-blocks, -c)  unlimited
max memory size         (kbytes, -m)  unlimited
locked memory           (kbytes, -l)  unlimited
max user processes              (-u)  89999
open files                      (-n)  1024
virtual mem size        (kbytes, -v)  unlimited
swap limit              (kbytes, -w)  unlimited
socket buffer size       (bytes, -b)  unlimited
pseudo-terminals                (-p)  unlimited
kqueues                         (-k)  unlimited
umtx shared locks               (-o)  unlimited
--End resource limits--
=======================<phase: check-sanity   >============================
===>  License LGPL21 accepted by the user
===========================================================================
=======================<phase: pkg-depends    >============================
===>   monodevelop-7.6.3.1 depends on file: /usr/local/sbin/pkg - not found
===>   Installing existing package /packages/All/pkg-1.10.5_5.txz
[120amd64-quarterly-job-15] Installing pkg-1.10.5_5...
[120amd64-quarterly-job-15] Extracting pkg-1.10.5_5: .......... done
===>   monodevelop-7.6.3.1 depends on file: /usr/local/sbin/pkg - found
===>   Returning to build of monodevelop-7.6.3.1
===========================================================================
=======================<phase: fetch-depends  >============================
===========================================================================
=======================<phase: fetch          >============================
===>  License LGPL21 accepted by the user
===> Fetching all distfiles required by monodevelop-7.6.3.1 for building
===========================================================================
=======================<phase: checksum       >============================
===>  License LGPL21 accepted by the user
===> Fetching all distfiles required by monodevelop-7.6.3.1 for building
=> SHA256 Checksum OK for extcore.0.8.46.nupkg.
=> SHA256 Checksum OK for fake.4.61.1.nupkg.
=> SHA256 Checksum OK for fsharp.compiler.codedom.0.9.2.nupkg.
=> SHA256 Checksum OK for fsharp.compiler.service.23.0.1.nupkg.
=> SHA256 Checksum OK for fsharp.core.4.3.3.nupkg.
=> SHA256 Checksum OK for fantomas.2.6.1.nupkg.
=> SHA256 Checksum OK for mono.cecil.0.10.0-beta6.nupkg.
=> SHA256 Checksum OK for newtonsoft.json.10.0.3.nupkg.
=> SHA256 Checksum OK for strongnamer.0.0.6.nupkg.
=> SHA256 Checksum OK for system.collections.immutable.1.3.1.nupkg.
=> SHA256 Checksum OK for system.reactive.core.3.1.1.nupkg.
=> SHA256 Checksum OK for system.reactive.interfaces.3.1.1.nupkg.
=> SHA256 Checksum OK for system.reactive.linq.3.1.1.nupkg.
=> SHA256 Checksum OK for system.reflection.metadata.1.4.2.nupkg.
=> SHA256 Checksum OK for system.valuetuple.4.4.0.nupkg.
=> SHA256 Checksum OK for clrheapallocationanalyzer.1.0.0.8.nupkg.
=> SHA256 Checksum OK for humanizer.core.2.2.0.nupkg.
=> SHA256 Checksum OK for icsharpcode.decompiler.3.0.0.3403-beta4.nupkg.
=> SHA256 Checksum OK for jetbrains.sharpziplib.stripped.0.87.20170615.10.nupkg.
=> SHA256 Checksum OK for largeaddressaware.1.0.1.nupkg.
=> SHA256 Checksum OK for libgit2sharp.nativebinaries.1.0.81.nupkg.
=> SHA256 Checksum OK for managedesent.1.9.4.nupkg.
=> SHA256 Checksum OK for microsoft.aspnet.mvc.5.2.3.nupkg.
=> SHA256 Checksum OK for microsoft.aspnet.razor.3.2.3.nupkg.
=> SHA256 Checksum OK for microsoft.aspnet.webpages.3.2.3.nupkg.
=> SHA256 Checksum OK for microsoft.codeanalysis.analyzers.1.1.0.nupkg.
=> SHA256 Checksum OK for microsoft.codeanalysis.analyzers.1.2.0-beta2.nupkg.
=> SHA256 Checksum OK for microsoft.codeanalysis.csharp.workspaces.1.3.2.nupkg.
=> SHA256 Checksum OK for microsoft.codeanalysis.csharp.1.3.2.nupkg.
=> SHA256 Checksum OK for microsoft.codeanalysis.common.1.3.2.nupkg.
<snip>
  MonoDevelop.CSharp.Completion/CSharpCompletionTextEditorExtension.IDebuggerCompletionProvider.cs(167,10): warning CS0618: 'CompletionTags' is obsolete: 'Use Microsoft.CodeAnalysis.Tags.WellKnownTags instead.' [/wrkdirs/usr/ports/devel/monodevelop/work/monodevelop-6594701/main/src/addins/CSharpBinding/CSharpBinding.csproj]
  MonoDevelop.CSharp.Completion/CSharpCompletionTextEditorExtension.IDebuggerCompletionProvider.cs(168,10): warning CS0618: 'CompletionTags' is obsolete: 'Use Microsoft.CodeAnalysis.Tags.WellKnownTags instead.' [/wrkdirs/usr/ports/devel/monodevelop/work/monodevelop-6594701/main/src/addins/CSharpBinding/CSharpBinding.csproj]
  MonoDevelop.CSharp.Completion/CSharpCompletionTextEditorExtension.IDebuggerCompletionProvider.cs(169,10): warning CS0618: 'CompletionTags' is obsolete: 'Use Microsoft.CodeAnalysis.Tags.WellKnownTags instead.' [/wrkdirs/usr/ports/devel/monodevelop/work/monodevelop-6594701/main/src/addins/CSharpBinding/CSharpBinding.csproj]
  MonoDevelop.CSharp.Completion/CSharpCompletionTextEditorExtension.IDebuggerCompletionProvider.cs(170,10): warning CS0618: 'CompletionTags' is obsolete: 'Use Microsoft.CodeAnalysis.Tags.WellKnownTags instead.' [/wrkdirs/usr/ports/devel/monodevelop/work/monodevelop-6594701/main/src/addins/CSharpBinding/CSharpBinding.csproj]
  MonoDevelop.CSharp.Completion/CSharpCompletionTextEditorExtension.IDebuggerCompletionProvider.cs(171,10): warning CS0618: 'CompletionTags' is obsolete: 'Use Microsoft.CodeAnalysis.Tags.WellKnownTags instead.' [/wrkdirs/usr/ports/devel/monodevelop/work/monodevelop-6594701/main/src/addins/CSharpBinding/CSharpBinding.csproj]
  MonoDevelop.CSharp.Completion/CSharpCompletionTextEditorExtension.IDebuggerCompletionProvider.cs(172,10): warning CS0618: 'CompletionTags' is obsolete: 'Use Microsoft.CodeAnalysis.Tags.WellKnownTags instead.' [/wrkdirs/usr/ports/devel/monodevelop/work/monodevelop-6594701/main/src/addins/CSharpBinding/CSharpBinding.csproj]
  MonoDevelop.CSharp.Completion/CSharpCompletionTextEditorExtension.IDebuggerCompletionProvider.cs(175,10): warning CS0618: 'CompletionTags' is obsolete: 'Use Microsoft.CodeAnalysis.Tags.WellKnownTags instead.' [/wrkdirs/usr/ports/devel/monodevelop/work/monodevelop-6594701/main/src/addins/CSharpBinding/CSharpBinding.csproj]
  MonoDevelop.CSharp.Completion/CSharpCompletionTextEditorExtension.IDebuggerCompletionProvider.cs(176,10): warning CS0618: 'CompletionTags' is obsolete: 'Use Microsoft.CodeAnalysis.Tags.WellKnownTags instead.' [/wrkdirs/usr/ports/devel/monodevelop/work/monodevelop-6594701/main/src/addins/CSharpBinding/CSharpBinding.csproj]
  MonoDevelop.CSharp.Completion/CSharpCompletionTextEditorExtension.IDebuggerCompletionProvider.cs(177,10): warning CS0618: 'CompletionTags' is obsolete: 'Use Microsoft.CodeAnalysis.Tags.WellKnownTags instead.' [/wrkdirs/usr/ports/devel/monodevelop/work/monodevelop-6594701/main/src/addins/CSharpBinding/CSharpBinding.csproj]
  MonoDevelop.CSharp.Completion/CSharpCompletionTextEditorExtension.IDebuggerCompletionProvider.cs(180,10): warning CS0618: 'CompletionTags' is obsolete: 'Use Microsoft.CodeAnalysis.Tags.WellKnownTags instead.' [/wrkdirs/usr/ports/devel/monodevelop/work/monodevelop-6594701/main/src/addins/CSharpBinding/CSharpBinding.csproj]
  MonoDevelop.CSharp.Completion/CSharpCompletionTextEditorExtension.IDebuggerCompletionProvider.cs(183,10): warning CS0618: 'CompletionTags' is obsolete: 'Use Microsoft.CodeAnalysis.Tags.WellKnownTags instead.' [/wrkdirs/usr/ports/devel/monodevelop/work/monodevelop-6594701/main/src/addins/CSharpBinding/CSharpBinding.csproj]
  MonoDevelop.CSharp.Completion/CSharpCompletionTextEditorExtension.IDebuggerCompletionProvider.cs(184,10): warning CS0618: 'CompletionTags' is obsolete: 'Use Microsoft.CodeAnalysis.Tags.WellKnownTags instead.' [/wrkdirs/usr/ports/devel/monodevelop/work/monodevelop-6594701/main/src/addins/CSharpBinding/CSharpBinding.csproj]
  MonoDevelop.CSharp.Completion/CSharpCompletionTextEditorExtension.IDebuggerCompletionProvider.cs(187,10): warning CS0618: 'CompletionTags' is obsolete: 'Use Microsoft.CodeAnalysis.Tags.WellKnownTags instead.' [/wrkdirs/usr/ports/devel/monodevelop/work/monodevelop-6594701/main/src/addins/CSharpBinding/CSharpBinding.csproj]
  MonoDevelop.CSharp.Completion/CSharpCompletionTextEditorExtension.IDebuggerCompletionProvider.cs(190,10): warning CS0618: 'CompletionTags' is obsolete: 'Use Microsoft.CodeAnalysis.Tags.WellKnownTags instead.' [/wrkdirs/usr/ports/devel/monodevelop/work/monodevelop-6594701/main/src/addins/CSharpBinding/CSharpBinding.csproj]


"/wrkdirs/usr/ports/devel/monodevelop/work/monodevelop-6594701/main/Main.sln" (default target) (1) ->
"/wrkdirs/usr/ports/devel/monodevelop/work/monodevelop-6594701/main/src/addins/MonoDevelop.GtkCore/MonoDevelop.GtkCore.csproj" (default target) (27) ->
"/wrkdirs/usr/ports/devel/monodevelop/work/monodevelop-6594701/main/src/addins/Deployment/MonoDevelop.Deployment/MonoDevelop.Deployment.csproj" (default target) (32:2) ->
(ResolveAssemblyReferences target) ->
  /usr/local/lib/mono/msbuild/15.0/bin/Microsoft.Common.CurrentVersion.targets(2126,5): warning MSB3277: Found conflicts between different versions of "ICSharpCode.SharpZipLib" that could not be resolved.  These reference conflicts are listed in the build log when log verbosity is set to detailed. [/wrkdirs/usr/ports/devel/monodevelop/work/monodevelop-6594701/main/src/addins/Deployment/MonoDevelop.Deployment/MonoDevelop.Deployment.csproj]


"/wrkdirs/usr/ports/devel/monodevelop/work/monodevelop-6594701/main/Main.sln" (default target) (1) ->
"/wrkdirs/usr/ports/devel/monodevelop/work/monodevelop-6594701/main/src/addins/MonoDevelop.Autotools/MonoDevelop.Autotools.csproj" (default target) (43) ->
(CoreCompile target) ->
  SimpleProjectMakefileHandler.cs(148,15): warning CS0618: 'TargetFramework.ClrVersion' is obsolete: 'This value is no longer meaningful' [/wrkdirs/usr/ports/devel/monodevelop/work/monodevelop-6594701/main/src/addins/MonoDevelop.Autotools/MonoDevelop.Autotools.csproj]


"/wrkdirs/usr/ports/devel/monodevelop/work/monodevelop-6594701/main/Main.sln" (default target) (1) ->
"/wrkdirs/usr/ports/devel/monodevelop/work/monodevelop-6594701/main/src/addins/CSharpBinding/AspNet/CSharpBinding.AspNet.csproj" (default target) (46) ->
"/wrkdirs/usr/ports/devel/monodevelop/work/monodevelop-6594701/main/src/addins/AspNet/MonoDevelop.AspNet.csproj" (default target) (47:2) ->
  Razor/RazorCSharpEditorExtension.cs(582,79): warning CS0672: Member 'RazorCSharpEditorExtension.HandleParameterCompletionAsync(CodeCompletionContext, char, CancellationToken)' overrides obsolete member 'CompletionTextEditorExtension.HandleParameterCompletionAsync(CodeCompletionContext, char, CancellationToken)'. Add the Obsolete attribute to 'RazorCSharpEditorExtension.HandleParameterCompletionAsync(CodeCompletionContext, char, CancellationToken)'. [/wrkdirs/usr/ports/devel/monodevelop/work/monodevelop-6594701/main/src/addins/AspNet/MonoDevelop.AspNet.csproj]
  WebForms/WebFormsToolboxNode.cs(170,27): warning CS0618: 'TargetFramework.ClrVersion' is obsolete: 'This value is no longer meaningful' [/wrkdirs/usr/ports/devel/monodevelop/work/monodevelop-6594701/main/src/addins/AspNet/MonoDevelop.AspNet.csproj]
  WebForms/WebFormsToolboxNode.cs(171,18): warning CS0618: 'TargetFramework.ClrVersion' is obsolete: 'This value is no longer meaningful' [/wrkdirs/usr/ports/devel/monodevelop/work/monodevelop-6594701/main/src/addins/AspNet/MonoDevelop.AspNet.csproj]
  WebForms/WebFormsEditorExtension.cs(528,55): warning CS0618: 'TargetFramework.ClrVersion' is obsolete: 'This value is no longer meaningful' [/wrkdirs/usr/ports/devel/monodevelop/work/monodevelop-6594701/main/src/addins/AspNet/MonoDevelop.AspNet.csproj]
  Razor/RazorCSharpEditorExtension.cs(590,11): warning CS0618: 'CompletionTextEditorExtension.HandleParameterCompletionAsync(CodeCompletionContext, char, CancellationToken)' is obsolete: 'Use HandleParameterCompletionAsync (CodeCompletionContext completionContext, SignatureHelpTriggerInfo triggerInfo, CancellationToken token)' [/wrkdirs/usr/ports/devel/monodevelop/work/monodevelop-6594701/main/src/addins/AspNet/MonoDevelop.AspNet.csproj]
  WebForms/WebFormsDirectiveCompletion.cs(113,36): warning CS0618: 'TargetFramework.ClrVersion' is obsolete: 'This value is no longer meaningful' [/wrkdirs/usr/ports/devel/monodevelop/work/monodevelop-6594701/main/src/addins/AspNet/MonoDevelop.AspNet.csproj]
  Razor/RazorCSharpEditorExtension.cs(368,42): warning CS0649: Field 'RazorCSharpEditorExtension.currentMappings' is never assigned to, and will always have its default value null [/wrkdirs/usr/ports/devel/monodevelop/work/monodevelop-6594701/main/src/addins/AspNet/MonoDevelop.AspNet.csproj]
  WebForms/WebFormsEditorExtension.cs(66,30): warning CS0649: Field 'WebFormsEditorExtension.documentBuilder' is never assigned to, and will always have its default value null [/wrkdirs/usr/ports/devel/monodevelop/work/monodevelop-6594701/main/src/addins/AspNet/MonoDevelop.AspNet.csproj]
  WebForms/WebFormsEditorExtension.cs(73,14): warning CS0169: The field 'WebFormsEditorExtension.projectedEditor' is never used [/wrkdirs/usr/ports/devel/monodevelop/work/monodevelop-6594701/main/src/addins/AspNet/MonoDevelop.AspNet.csproj]
  WebForms/WebFormsEditorExtension.cs(67,14): warning CS0414: The field 'WebFormsEditorExtension.localDocumentProjection' is assigned but its value is never used [/wrkdirs/usr/ports/devel/monodevelop/work/monodevelop-6594701/main/src/addins/AspNet/MonoDevelop.AspNet.csproj]


"/wrkdirs/usr/ports/devel/monodevelop/work/monodevelop-6594701/main/Main.sln" (default target) (1) ->
"/wrkdirs/usr/ports/devel/monodevelop/work/monodevelop-6594701/main/src/addins/CSharpBinding/AspNet/CSharpBinding.AspNet.csproj" (default target) (46) ->
  RazorCSharpCompletionBuilder.cs(98,11): warning CS0618: 'CompletionTextEditorExtension.HandleParameterCompletionAsync(CodeCompletionContext, char, CancellationToken)' is obsolete: 'Use HandleParameterCompletionAsync (CodeCompletionContext completionContext, SignatureHelpTriggerInfo triggerInfo, CancellationToken token)' [/wrkdirs/usr/ports/devel/monodevelop/work/monodevelop-6594701/main/src/addins/CSharpBinding/AspNet/CSharpBinding.AspNet.csproj]


"/wrkdirs/usr/ports/devel/monodevelop/work/monodevelop-6594701/main/Main.sln" (default target) (1) ->
"/wrkdirs/usr/ports/devel/monodevelop/work/monodevelop-6594701/main/src/addins/GnomePlatform/GnomePlatform.csproj" (default target) (53) ->
  Gio.cs(82,18): warning CS0649: Field 'Gio.GList.prev' is never assigned to, and will always have its default value [/wrkdirs/usr/ports/devel/monodevelop/work/monodevelop-6594701/main/src/addins/GnomePlatform/GnomePlatform.csproj]
  GnomePlatform.cs(58,22): warning CS0649: Field 'GnomePlatform.GnomeVfsApp.DisplayName' is never assigned to, and will always have its default value null [/wrkdirs/usr/ports/devel/monodevelop/work/monodevelop-6594701/main/src/addins/GnomePlatform/GnomePlatform.csproj]
  Gio.cs(81,18): warning CS0649: Field 'Gio.GList.next' is never assigned to, and will always have its default value [/wrkdirs/usr/ports/devel/monodevelop/work/monodevelop-6594701/main/src/addins/GnomePlatform/GnomePlatform.csproj]
  Gio.cs(80,18): warning CS0649: Field 'Gio.GList.data' is never assigned to, and will always have its default value [/wrkdirs/usr/ports/devel/monodevelop/work/monodevelop-6594701/main/src/addins/GnomePlatform/GnomePlatform.csproj]
  GnomePlatform.cs(58,18): warning CS0649: Field 'GnomePlatform.GnomeVfsApp.Id' is never assigned to, and will always have its default value null [/wrkdirs/usr/ports/devel/monodevelop/work/monodevelop-6594701/main/src/addins/GnomePlatform/GnomePlatform.csproj]
  GnomePlatform.cs(58,35): warning CS0649: Field 'GnomePlatform.GnomeVfsApp.Command' is never assigned to, and will always have its default value null [/wrkdirs/usr/ports/devel/monodevelop/work/monodevelop-6594701/main/src/addins/GnomePlatform/GnomePlatform.csproj]


"/wrkdirs/usr/ports/devel/monodevelop/work/monodevelop-6594701/main/Main.sln" (default target) (1) ->
"/wrkdirs/usr/ports/devel/monodevelop/work/monodevelop-6594701/main/src/addins/MonoDevelop.AssemblyBrowser/MonoDevelop.AssemblyBrowser.csproj" (default target) (54) ->
(ResolveAssemblyReferences target) ->
  /usr/local/lib/mono/msbuild/15.0/bin/Microsoft.Common.CurrentVersion.targets(2126,5): warning MSB3277: Found conflicts between different versions of "ICSharpCode.Decompiler" that could not be resolved.  These reference conflicts are listed in the build log when log verbosity is set to detailed. [/wrkdirs/usr/ports/devel/monodevelop/work/monodevelop-6594701/main/src/addins/MonoDevelop.AssemblyBrowser/MonoDevelop.AssemblyBrowser.csproj]


"/wrkdirs/usr/ports/devel/monodevelop/work/monodevelop-6594701/main/Main.sln" (default target) (1) ->
"/wrkdirs/usr/ports/devel/monodevelop/work/monodevelop-6594701/main/src/addins/MonoDevelop.UnitTesting.NUnit/NUnitRunner/NUnitRunner.csproj" (default target) (57) ->
  /usr/local/lib/mono/msbuild/15.0/bin/Microsoft.Common.CurrentVersion.targets(2126,5): warning MSB3276: Found conflicts between different versions of the same dependent assembly. Please set the "AutoGenerateBindingRedirects" property to true in the project file. For more information, see http://go.microsoft.com/fwlink/?LinkId=294190. [/wrkdirs/usr/ports/devel/monodevelop/work/monodevelop-6594701/main/src/addins/MonoDevelop.UnitTesting.NUnit/NUnitRunner/NUnitRunner.csproj]


"/wrkdirs/usr/ports/devel/monodevelop/work/monodevelop-6594701/main/Main.sln" (default target) (1) ->
"/wrkdirs/usr/ports/devel/monodevelop/work/monodevelop-6594701/main/src/addins/AspNet/Tests/MonoDevelop.AspNet.Tests.csproj" (default target) (58) ->
(CoreCompile target) ->
  Razor/RazorCompletionTesting.cs(95,15): warning CS0618: 'CompletionTextEditorExtension.HandleParameterCompletionAsync(CodeCompletionContext, char, CancellationToken)' is obsolete: 'Use HandleParameterCompletionAsync (CodeCompletionContext completionContext, SignatureHelpTriggerInfo triggerInfo, CancellationToken token)' [/wrkdirs/usr/ports/devel/monodevelop/work/monodevelop-6594701/main/src/addins/AspNet/Tests/MonoDevelop.AspNet.Tests.csproj]


"/wrkdirs/usr/ports/devel/monodevelop/work/monodevelop-6594701/main/Main.sln" (default target) (1) ->
"/wrkdirs/usr/ports/devel/monodevelop/work/monodevelop-6594701/main/src/addins/MonoDevelop.Debugger/MonoDevelop.Debugger.Tests/MonoDevelop.Debugger.Tests.csproj" (default target) (66) ->
  /wrkdirs/usr/ports/devel/monodevelop/work/monodevelop-6594701/main/external/debugger-libs/UnitTests/Mono.Debugging.Tests/Shared/EvaluationTests.cs(2828,22): warning CS0184: The given expression is never of the provided ('byte?') type [/wrkdirs/usr/ports/devel/monodevelop/work/monodevelop-6594701/main/src/addins/MonoDevelop.Debugger/MonoDevelop.Debugger.Tests/MonoDevelop.Debugger.Tests.csproj]
  /wrkdirs/usr/ports/devel/monodevelop/work/monodevelop-6594701/main/external/debugger-libs/UnitTests/Mono.Debugging.Tests/Shared/EvaluationTests.cs(2833,22): warning CS0183: The given expression is always of the provided ('byte?') type [/wrkdirs/usr/ports/devel/monodevelop/work/monodevelop-6594701/main/src/addins/MonoDevelop.Debugger/MonoDevelop.Debugger.Tests/MonoDevelop.Debugger.Tests.csproj]
  /wrkdirs/usr/ports/devel/monodevelop/work/monodevelop-6594701/main/external/debugger-libs/UnitTests/Mono.Debugging.Tests/Shared/EvaluationTests.cs(2838,22): warning CS0183: The given expression is always of the provided ('double') type [/wrkdirs/usr/ports/devel/monodevelop/work/monodevelop-6594701/main/src/addins/MonoDevelop.Debugger/MonoDevelop.Debugger.Tests/MonoDevelop.Debugger.Tests.csproj]
  /wrkdirs/usr/ports/devel/monodevelop/work/monodevelop-6594701/main/external/debugger-libs/UnitTests/Mono.Debugging.Tests/Shared/EvaluationTests.cs(2843,22): warning CS0184: The given expression is never of the provided ('float') type [/wrkdirs/usr/ports/devel/monodevelop/work/monodevelop-6594701/main/src/addins/MonoDevelop.Debugger/MonoDevelop.Debugger.Tests/MonoDevelop.Debugger.Tests.csproj]
  /wrkdirs/usr/ports/devel/monodevelop/work/monodevelop-6594701/main/external/debugger-libs/UnitTests/Mono.Debugging.Tests/Shared/EvaluationTests.cs(2847,22): warning CS0184: The given expression is never of the provided ('object') type [/wrkdirs/usr/ports/devel/monodevelop/work/monodevelop-6594701/main/src/addins/MonoDevelop.Debugger/MonoDevelop.Debugger.Tests/MonoDevelop.Debugger.Tests.csproj]
  /wrkdirs/usr/ports/devel/monodevelop/work/monodevelop-6594701/main/external/debugger-libs/UnitTests/Mono.Debugging.Tests/Shared/DebugTests.cs(98,3): warning CS1587: XML comment is not placed on a valid language element [/wrkdirs/usr/ports/devel/monodevelop/work/monodevelop-6594701/main/src/addins/MonoDevelop.Debugger/MonoDevelop.Debugger.Tests/MonoDevelop.Debugger.Tests.csproj]
  /wrkdirs/usr/ports/devel/monodevelop/work/monodevelop-6594701/main/external/debugger-libs/UnitTests/Mono.Debugging.Tests/Shared/DebugTests.cs(91,3): warning CS1587: XML comment is not placed on a valid language element [/wrkdirs/usr/ports/devel/monodevelop/work/monodevelop-6594701/main/src/addins/MonoDevelop.Debugger/MonoDevelop.Debugger.Tests/MonoDevelop.Debugger.Tests.csproj]
  /wrkdirs/usr/ports/devel/monodevelop/work/monodevelop-6594701/main/external/debugger-libs/UnitTests/Mono.Debugging.Tests/Shared/DebugTests.cs(86,3): warning CS1587: XML comment is not placed on a valid language element [/wrkdirs/usr/ports/devel/monodevelop/work/monodevelop-6594701/main/src/addins/MonoDevelop.Debugger/MonoDevelop.Debugger.Tests/MonoDevelop.Debugger.Tests.csproj]
  /wrkdirs/usr/ports/devel/monodevelop/work/monodevelop-6594701/main/external/debugger-libs/UnitTests/Mono.Debugging.Tests/Shared/DebugTests.cs(81,3): warning CS1587: XML comment is not placed on a valid language element [/wrkdirs/usr/ports/devel/monodevelop/work/monodevelop-6594701/main/src/addins/MonoDevelop.Debugger/MonoDevelop.Debugger.Tests/MonoDevelop.Debugger.Tests.csproj]
  /wrkdirs/usr/ports/devel/monodevelop/work/monodevelop-6594701/main/external/debugger-libs/UnitTests/Mono.Debugging.Tests/Shared/DebugTests.cs(108,20): warning CS1572: XML comment has a param tag for 'sourcePath', but there is no parameter by that name [/wrkdirs/usr/ports/devel/monodevelop/work/monodevelop-6594701/main/src/addins/MonoDevelop.Debugger/MonoDevelop.Debugger.Tests/MonoDevelop.Debugger.Tests.csproj]


"/wrkdirs/usr/ports/devel/monodevelop/work/monodevelop-6594701/main/Main.sln" (default target) (1) ->
"/wrkdirs/usr/ports/devel/monodevelop/work/monodevelop-6594701/main/src/addins/MonoDevelop.Debugger.Gdb/MonoDevelop.Debugger.Gdb.csproj" (default target) (67) ->
  GdbSessionFactory.cs(37,34): warning CS0618: 'IDebuggerEngine' is obsolete: 'This interface is going to be removed. Please use MonoDevelop.Debugger.DebuggerEngineBackend' [/wrkdirs/usr/ports/devel/monodevelop/work/monodevelop-6594701/main/src/addins/MonoDevelop.Debugger.Gdb/MonoDevelop.Debugger.Gdb.csproj]
  GdbBacktrace.cs(334,25): warning CS0612: 'SourceLocation.SourceLocation(string, string, int)' is obsolete [/wrkdirs/usr/ports/devel/monodevelop/work/monodevelop-6594701/main/src/addins/MonoDevelop.Debugger.Gdb/MonoDevelop.Debugger.Gdb.csproj]


"/wrkdirs/usr/ports/devel/monodevelop/work/monodevelop-6594701/main/Main.sln" (default target) (1) ->
"/wrkdirs/usr/ports/devel/monodevelop/work/monodevelop-6594701/main/src/addins/MonoDevelop.PackageManagement/MonoDevelop.PackageManagement.Tests/MonoDevelop.PackageManagement.Tests.csproj" (default target) (68) ->
(ResolveAssemblyReferences target) ->
  /usr/local/lib/mono/msbuild/15.0/bin/Microsoft.Common.CurrentVersion.targets(2126,5): warning MSB3277: Found conflicts between different versions of "System.IO.Compression" that could not be resolved.  These reference conflicts are listed in the build log when log verbosity is set to detailed. [/wrkdirs/usr/ports/devel/monodevelop/work/monodevelop-6594701/main/src/addins/MonoDevelop.PackageManagement/MonoDevelop.PackageManagement.Tests/MonoDevelop.PackageManagement.Tests.csproj]


"/wrkdirs/usr/ports/devel/monodevelop/work/monodevelop-6594701/main/Main.sln" (default target) (1) ->
"/wrkdirs/usr/ports/devel/monodevelop/work/monodevelop-6594701/main/src/tools/mdhost/mdhost.csproj" (default target) (69) ->
  /usr/local/lib/mono/msbuild/15.0/bin/Microsoft.Common.CurrentVersion.targets(2126,5): warning MSB3276: Found conflicts between different versions of the same dependent assembly. Please set the "AutoGenerateBindingRedirects" property to true in the project file. For more information, see http://go.microsoft.com/fwlink/?LinkId=294190. [/wrkdirs/usr/ports/devel/monodevelop/work/monodevelop-6594701/main/src/tools/mdhost/mdhost.csproj]


"/wrkdirs/usr/ports/devel/monodevelop/work/monodevelop-6594701/main/Main.sln" (default target) (1) ->
"/wrkdirs/usr/ports/devel/monodevelop/work/monodevelop-6594701/main/src/tools/mdtool/mdtool.csproj" (default target) (70) ->
  /usr/local/lib/mono/msbuild/15.0/bin/Microsoft.Common.CurrentVersion.targets(2126,5): warning MSB3276: Found conflicts between different versions of the same dependent assembly. Please set the "AutoGenerateBindingRedirects" property to true in the project file. For more information, see http://go.microsoft.com/fwlink/?LinkId=294190. [/wrkdirs/usr/ports/devel/monodevelop/work/monodevelop-6594701/main/src/tools/mdtool/mdtool.csproj]


"/wrkdirs/usr/ports/devel/monodevelop/work/monodevelop-6594701/main/Main.sln" (default target) (1) ->
"/wrkdirs/usr/ports/devel/monodevelop/work/monodevelop-6594701/main/src/tools/mdmonitor/mdmonitor.csproj" (default target) (71) ->
  /usr/local/lib/mono/msbuild/15.0/bin/Microsoft.Common.CurrentVersion.targets(2126,5): warning MSB3276: Found conflicts between different versions of the same dependent assembly. Please set the "AutoGenerateBindingRedirects" property to true in the project file. For more information, see http://go.microsoft.com/fwlink/?LinkId=294190. [/wrkdirs/usr/ports/devel/monodevelop/work/monodevelop-6594701/main/src/tools/mdmonitor/mdmonitor.csproj]


"/wrkdirs/usr/ports/devel/monodevelop/work/monodevelop-6594701/main/Main.sln" (default target) (1) ->
"/wrkdirs/usr/ports/devel/monodevelop/work/monodevelop-6594701/main/tests/Ide.Tests/MonoDevelop.Ide.Tests.csproj" (default target) (75) ->
"/wrkdirs/usr/ports/devel/monodevelop/work/monodevelop-6594701/main/tests/MonoDevelop.Core.Tests/MonoDevelop.Core.Tests.csproj" (default target) (76:2) ->
(CoreCompile target) ->
  MonoDevelop.Core.Assemblies/SystemAssemblyServiceTests.cs(42,17): warning CS0618: 'SystemAssemblyService.ContainsReferenceToSystemRuntime(string)' is obsolete: 'Use RequiresFacadeAssemblies (string fileName)' [/wrkdirs/usr/ports/devel/monodevelop/work/monodevelop-6594701/main/tests/MonoDevelop.Core.Tests/MonoDevelop.Core.Tests.csproj]
  MonoDevelop.Core.Assemblies/SystemAssemblyServiceTests.cs(50,23): warning CS0618: 'SystemAssemblyService.ContainsReferenceToSystemRuntimeAsync(string)' is obsolete: 'Use RequiresFacadeAssembliesAsync (string fileName)' [/wrkdirs/usr/ports/devel/monodevelop/work/monodevelop-6594701/main/tests/MonoDevelop.Core.Tests/MonoDevelop.Core.Tests.csproj]


"/wrkdirs/usr/ports/devel/monodevelop/work/monodevelop-6594701/main/Main.sln" (default target) (1) ->
"/wrkdirs/usr/ports/devel/monodevelop/work/monodevelop-6594701/main/src/addins/MonoDevelop.UnitTesting.NUnit/NUnit3Runner/NUnit3Runner.csproj" (default target) (80) ->
(ResolveAssemblyReferences target) ->
  /usr/local/lib/mono/msbuild/15.0/bin/Microsoft.Common.CurrentVersion.targets(2126,5): warning MSB3276: Found conflicts between different versions of the same dependent assembly. Please set the "AutoGenerateBindingRedirects" property to true in the project file. For more information, see http://go.microsoft.com/fwlink/?LinkId=294190. [/wrkdirs/usr/ports/devel/monodevelop/work/monodevelop-6594701/main/src/addins/MonoDevelop.UnitTesting.NUnit/NUnit3Runner/NUnit3Runner.csproj]


"/wrkdirs/usr/ports/devel/monodevelop/work/monodevelop-6594701/main/Main.sln" (default target) (1) ->
"/wrkdirs/usr/ports/devel/monodevelop/work/monodevelop-6594701/main/external/fsharpbinding/MonoDevelop.FSharpBinding/MonoDevelop.FSharp.fsproj" (default target) (81) ->
"/wrkdirs/usr/ports/devel/monodevelop/work/monodevelop-6594701/main/external/fsharpbinding/MonoDevelop.FSharp.Shared/MonoDevelop.FSharp.Shared.fsproj" (default target) (83:2) ->
  /usr/local/lib/mono/msbuild/15.0/bin/Microsoft.Common.CurrentVersion.targets(2126,5): warning MSB3245: Could not resolve this reference. Could not locate the assembly "ISymWrapper, Version=4.0.0.0, Culture=neutral, PublicKeyToken=b03f5f7f11d50a3a". Check to make sure the assembly exists on disk. If this reference is required by your code, you may get compilation errors. [/wrkdirs/usr/ports/devel/monodevelop/work/monodevelop-6594701/main/external/fsharpbinding/MonoDevelop.FSharp.Shared/MonoDevelop.FSharp.Shared.fsproj]
  /usr/local/lib/mono/msbuild/15.0/bin/Microsoft.Common.CurrentVersion.targets(2126,5): warning MSB3245: Could not resolve this reference. Could not locate the assembly "System.IO, Version=4.0.0.0, Culture=neutral, PublicKeyToken=b03f5f7f11d50a3a". Check to make sure the assembly exists on disk. If this reference is required by your code, you may get compilation errors. [/wrkdirs/usr/ports/devel/monodevelop/work/monodevelop-6594701/main/external/fsharpbinding/MonoDevelop.FSharp.Shared/MonoDevelop.FSharp.Shared.fsproj]
  /usr/local/lib/mono/msbuild/15.0/bin/Microsoft.Common.CurrentVersion.targets(2126,5): warning MSB3245: Could not resolve this reference. Could not locate the assembly "System.Runtime, Version=4.0.0.0, Culture=neutral, PublicKeyToken=b03f5f7f11d50a3a". Check to make sure the assembly exists on disk. If this reference is required by your code, you may get compilation errors. [/wrkdirs/usr/ports/devel/monodevelop/work/monodevelop-6594701/main/external/fsharpbinding/MonoDevelop.FSharp.Shared/MonoDevelop.FSharp.Shared.fsproj]
  /usr/local/lib/mono/msbuild/15.0/bin/Microsoft.Common.CurrentVersion.targets(2126,5): warning MSB3245: Could not resolve this reference. Could not locate the assembly "Microsoft.DiaSymReader". Check to make sure the assembly exists on disk. If this reference is required by your code, you may get compilation errors. [/wrkdirs/usr/ports/devel/monodevelop/work/monodevelop-6594701/main/external/fsharpbinding/MonoDevelop.FSharp.Shared/MonoDevelop.FSharp.Shared.fsproj]
  /usr/local/lib/mono/msbuild/15.0/bin/Microsoft.Common.CurrentVersion.targets(2126,5): warning MSB3245: Could not resolve this reference. Could not locate the assembly "Microsoft.DiaSymReader.PortablePdb". Check to make sure the assembly exists on disk. If this reference is required by your code, you may get compilation errors. [/wrkdirs/usr/ports/devel/monodevelop/work/monodevelop-6594701/main/external/fsharpbinding/MonoDevelop.FSharp.Shared/MonoDevelop.FSharp.Shared.fsproj]


"/wrkdirs/usr/ports/devel/monodevelop/work/monodevelop-6594701/main/Main.sln" (default target) (1) ->
"/wrkdirs/usr/ports/devel/monodevelop/work/monodevelop-6594701/main/external/fsharpbinding/MonoDevelop.FSharpBinding/MonoDevelop.FSharp.fsproj" (default target) (81) ->
  /usr/local/lib/mono/msbuild/15.0/bin/Microsoft.Common.CurrentVersion.targets(2126,5): warning MSB3245: Could not resolve this reference. Could not locate the assembly "Xamarin.Mac". Check to make sure the assembly exists on disk. If this reference is required by your code, you may get compilation errors. [/wrkdirs/usr/ports/devel/monodevelop/work/monodevelop-6594701/main/external/fsharpbinding/MonoDevelop.FSharpBinding/MonoDevelop.FSharp.fsproj]
  /usr/local/lib/mono/msbuild/15.0/bin/Microsoft.Common.CurrentVersion.targets(2126,5): warning MSB3245: Could not resolve this reference. Could not locate the assembly "Microsoft.DiaSymReader". Check to make sure the assembly exists on disk. If this reference is required by your code, you may get compilation errors. [/wrkdirs/usr/ports/devel/monodevelop/work/monodevelop-6594701/main/external/fsharpbinding/MonoDevelop.FSharpBinding/MonoDevelop.FSharp.fsproj]
  /usr/local/lib/mono/msbuild/15.0/bin/Microsoft.Common.CurrentVersion.targets(2126,5): warning MSB3245: Could not resolve this reference. Could not locate the assembly "Microsoft.DiaSymReader.PortablePdb". Check to make sure the assembly exists on disk. If this reference is required by your code, you may get compilation errors. [/wrkdirs/usr/ports/devel/monodevelop/work/monodevelop-6594701/main/external/fsharpbinding/MonoDevelop.FSharpBinding/MonoDevelop.FSharp.fsproj]


"/wrkdirs/usr/ports/devel/monodevelop/work/monodevelop-6594701/main/Main.sln" (default target) (1) ->
"/wrkdirs/usr/ports/devel/monodevelop/work/monodevelop-6594701/main/external/fsharpbinding/MonoDevelop.FSharpi.Service/MonoDevelop.FSharpInteractive.Service.fsproj" (default target) (84) ->
  /usr/local/lib/mono/msbuild/15.0/bin/Microsoft.Common.CurrentVersion.targets(2126,5): warning MSB3245: Could not resolve this reference. Could not locate the assembly "ISymWrapper, Version=4.0.0.0, Culture=neutral, PublicKeyToken=b03f5f7f11d50a3a". Check to make sure the assembly exists on disk. If this reference is required by your code, you may get compilation errors. [/wrkdirs/usr/ports/devel/monodevelop/work/monodevelop-6594701/main/external/fsharpbinding/MonoDevelop.FSharpi.Service/MonoDevelop.FSharpInteractive.Service.fsproj]
  /usr/local/lib/mono/msbuild/15.0/bin/Microsoft.Common.CurrentVersion.targets(2126,5): warning MSB3245: Could not resolve this reference. Could not locate the assembly "System.IO, Version=4.0.0.0, Culture=neutral, PublicKeyToken=b03f5f7f11d50a3a". Check to make sure the assembly exists on disk. If this reference is required by your code, you may get compilation errors. [/wrkdirs/usr/ports/devel/monodevelop/work/monodevelop-6594701/main/external/fsharpbinding/MonoDevelop.FSharpi.Service/MonoDevelop.FSharpInteractive.Service.fsproj]
  /usr/local/lib/mono/msbuild/15.0/bin/Microsoft.Common.CurrentVersion.targets(2126,5): warning MSB3245: Could not resolve this reference. Could not locate the assembly "System.Runtime, Version=4.0.0.0, Culture=neutral, PublicKeyToken=b03f5f7f11d50a3a". Check to make sure the assembly exists on disk. If this reference is required by your code, you may get compilation errors. [/wrkdirs/usr/ports/devel/monodevelop/work/monodevelop-6594701/main/external/fsharpbinding/MonoDevelop.FSharpi.Service/MonoDevelop.FSharpInteractive.Service.fsproj]
  /usr/local/lib/mono/msbuild/15.0/bin/Microsoft.Common.CurrentVersion.targets(2126,5): warning MSB3245: Could not resolve this reference. Could not locate the assembly "Microsoft.DiaSymReader". Check to make sure the assembly exists on disk. If this reference is required by your code, you may get compilation errors. [/wrkdirs/usr/ports/devel/monodevelop/work/monodevelop-6594701/main/external/fsharpbinding/MonoDevelop.FSharpi.Service/MonoDevelop.FSharpInteractive.Service.fsproj]
  /usr/local/lib/mono/msbuild/15.0/bin/Microsoft.Common.CurrentVersion.targets(2126,5): warning MSB3245: Could not resolve this reference. Could not locate the assembly "Microsoft.DiaSymReader.PortablePdb". Check to make sure the assembly exists on disk. If this reference is required by your code, you may get compilation errors. [/wrkdirs/usr/ports/devel/monodevelop/work/monodevelop-6594701/main/external/fsharpbinding/MonoDevelop.FSharpi.Service/MonoDevelop.FSharpInteractive.Service.fsproj]
  /usr/local/lib/mono/msbuild/15.0/bin/Microsoft.Common.CurrentVersion.targets(2126,5): warning MSB3276: Found conflicts between different versions of the same dependent assembly. Please set the "AutoGenerateBindingRedirects" property to true in the project file. For more information, see http://go.microsoft.com/fwlink/?LinkId=294190. [/wrkdirs/usr/ports/devel/monodevelop/work/monodevelop-6594701/main/external/fsharpbinding/MonoDevelop.FSharpi.Service/MonoDevelop.FSharpInteractive.Service.fsproj]


"/wrkdirs/usr/ports/devel/monodevelop/work/monodevelop-6594701/main/Main.sln" (default target) (1) ->
"/wrkdirs/usr/ports/devel/monodevelop/work/monodevelop-6594701/main/external/fsharpbinding/MonoDevelop.FSharp.Tests/MonoDevelop.FSharp.Tests.fsproj" (default target) (85) ->
  /usr/local/lib/mono/msbuild/15.0/bin/Microsoft.Common.CurrentVersion.targets(2126,5): warning MSB3245: Could not resolve this reference. Could not locate the assembly "Xamarin.Mac". Check to make sure the assembly exists on disk. If this reference is required by your code, you may get compilation errors. [/wrkdirs/usr/ports/devel/monodevelop/work/monodevelop-6594701/main/external/fsharpbinding/MonoDevelop.FSharp.Tests/MonoDevelop.FSharp.Tests.fsproj]
  /usr/local/lib/mono/msbuild/15.0/bin/Microsoft.Common.CurrentVersion.targets(2126,5): warning MSB3245: Could not resolve this reference. Could not locate the assembly "ISymWrapper, Version=4.0.0.0, Culture=neutral, PublicKeyToken=b03f5f7f11d50a3a". Check to make sure the assembly exists on disk. If this reference is required by your code, you may get compilation errors. [/wrkdirs/usr/ports/devel/monodevelop/work/monodevelop-6594701/main/external/fsharpbinding/MonoDevelop.FSharp.Tests/MonoDevelop.FSharp.Tests.fsproj]
  /usr/local/lib/mono/msbuild/15.0/bin/Microsoft.Common.CurrentVersion.targets(2126,5): warning MSB3245: Could not resolve this reference. Could not locate the assembly "System.IO, Version=4.0.0.0, Culture=neutral, PublicKeyToken=b03f5f7f11d50a3a". Check to make sure the assembly exists on disk. If this reference is required by your code, you may get compilation errors. [/wrkdirs/usr/ports/devel/monodevelop/work/monodevelop-6594701/main/external/fsharpbinding/MonoDevelop.FSharp.Tests/MonoDevelop.FSharp.Tests.fsproj]
  /usr/local/lib/mono/msbuild/15.0/bin/Microsoft.Common.CurrentVersion.targets(2126,5): warning MSB3245: Could not resolve this reference. Could not locate the assembly "System.Runtime, Version=4.0.0.0, Culture=neutral, PublicKeyToken=b03f5f7f11d50a3a". Check to make sure the assembly exists on disk. If this reference is required by your code, you may get compilation errors. [/wrkdirs/usr/ports/devel/monodevelop/work/monodevelop-6594701/main/external/fsharpbinding/MonoDevelop.FSharp.Tests/MonoDevelop.FSharp.Tests.fsproj]
  /usr/local/lib/mono/msbuild/15.0/bin/Microsoft.Common.CurrentVersion.targets(2126,5): warning MSB3245: Could not resolve this reference. Could not locate the assembly "Microsoft.DiaSymReader". Check to make sure the assembly exists on disk. If this reference is required by your code, you may get compilation errors. [/wrkdirs/usr/ports/devel/monodevelop/work/monodevelop-6594701/main/external/fsharpbinding/MonoDevelop.FSharp.Tests/MonoDevelop.FSharp.Tests.fsproj]
  /usr/local/lib/mono/msbuild/15.0/bin/Microsoft.Common.CurrentVersion.targets(2126,5): warning MSB3245: Could not resolve this reference. Could not locate the assembly "Microsoft.DiaSymReader.PortablePdb". Check to make sure the assembly exists on disk. If this reference is required by your code, you may get compilation errors. [/wrkdirs/usr/ports/devel/monodevelop/work/monodevelop-6594701/main/external/fsharpbinding/MonoDevelop.FSharp.Tests/MonoDevelop.FSharp.Tests.fsproj]
  /usr/local/lib/mono/msbuild/15.0/bin/Microsoft.Common.CurrentVersion.targets(2126,5): warning MSB3277: Found conflicts between different versions of "System.IO" that could not be resolved.  These reference conflicts are listed in the build log when log verbosity is set to detailed. [/wrkdirs/usr/ports/devel/monodevelop/work/monodevelop-6594701/main/external/fsharpbinding/MonoDevelop.FSharp.Tests/MonoDevelop.FSharp.Tests.fsproj]
  /usr/local/lib/mono/msbuild/15.0/bin/Microsoft.Common.CurrentVersion.targets(2126,5): warning MSB3277: Found conflicts between different versions of "System.Runtime" that could not be resolved.  These reference conflicts are listed in the build log when log verbosity is set to detailed. [/wrkdirs/usr/ports/devel/monodevelop/work/monodevelop-6594701/main/external/fsharpbinding/MonoDevelop.FSharp.Tests/MonoDevelop.FSharp.Tests.fsproj]


"/wrkdirs/usr/ports/devel/monodevelop/work/monodevelop-6594701/main/Main.sln" (default target) (1) ->
"/wrkdirs/usr/ports/devel/monodevelop/work/monodevelop-6594701/main/src/addins/VersionControl/MonoDevelop.VersionControl.Git/MonoDevelop.VersionControl.Git.csproj" (default target) (21) ->
(BeforeBuild target) ->
  /wrkdirs/usr/ports/devel/monodevelop/work/monodevelop-6594701/main/external/libgit2/src/openssl_stream.c(36,3): error G5E568970: incomplete definition of type 'struct bio_st' [/wrkdirs/usr/ports/devel/monodevelop/work/monodevelop-6594701/main/src/addins/VersionControl/MonoDevelop.VersionControl.Git/MonoDevelop.VersionControl.Git.csproj]
  /wrkdirs/usr/ports/devel/monodevelop/work/monodevelop-6594701/main/external/libgit2/src/openssl_stream.c(37,3): error G5E568970: incomplete definition of type 'struct bio_st' [/wrkdirs/usr/ports/devel/monodevelop/work/monodevelop-6594701/main/src/addins/VersionControl/MonoDevelop.VersionControl.Git/MonoDevelop.VersionControl.Git.csproj]
  /wrkdirs/usr/ports/devel/monodevelop/work/monodevelop-6594701/main/external/libgit2/src/openssl_stream.c(38,3): error G5E568970: incomplete definition of type 'struct bio_st' [/wrkdirs/usr/ports/devel/monodevelop/work/monodevelop-6594701/main/src/addins/VersionControl/MonoDevelop.VersionControl.Git/MonoDevelop.VersionControl.Git.csproj]
  /wrkdirs/usr/ports/devel/monodevelop/work/monodevelop-6594701/main/external/libgit2/src/openssl_stream.c(39,3): error G5E568970: incomplete definition of type 'struct bio_st' [/wrkdirs/usr/ports/devel/monodevelop/work/monodevelop-6594701/main/src/addins/VersionControl/MonoDevelop.VersionControl.Git/MonoDevelop.VersionControl.Git.csproj]
  /wrkdirs/usr/ports/devel/monodevelop/work/monodevelop-6594701/main/external/libgit2/src/openssl_stream.c(49,3): error G5E568970: incomplete definition of type 'struct bio_st' [/wrkdirs/usr/ports/devel/monodevelop/work/monodevelop-6594701/main/src/addins/VersionControl/MonoDevelop.VersionControl.Git/MonoDevelop.VersionControl.Git.csproj]
  /wrkdirs/usr/ports/devel/monodevelop/work/monodevelop-6594701/main/external/libgit2/src/openssl_stream.c(50,3): error G5E568970: incomplete definition of type 'struct bio_st' [/wrkdirs/usr/ports/devel/monodevelop/work/monodevelop-6594701/main/src/addins/VersionControl/MonoDevelop.VersionControl.Git/MonoDevelop.VersionControl.Git.csproj]
  /wrkdirs/usr/ports/devel/monodevelop/work/monodevelop-6594701/main/external/libgit2/src/openssl_stream.c(51,3): error G5E568970: incomplete definition of type 'struct bio_st' [/wrkdirs/usr/ports/devel/monodevelop/work/monodevelop-6594701/main/src/addins/VersionControl/MonoDevelop.VersionControl.Git/MonoDevelop.VersionControl.Git.csproj]
  /wrkdirs/usr/ports/devel/monodevelop/work/monodevelop-6594701/main/external/libgit2/src/openssl_stream.c(52,3): error G5E568970: incomplete definition of type 'struct bio_st' [/wrkdirs/usr/ports/devel/monodevelop/work/monodevelop-6594701/main/src/addins/VersionControl/MonoDevelop.VersionControl.Git/MonoDevelop.VersionControl.Git.csproj]
  /wrkdirs/usr/ports/devel/monodevelop/work/monodevelop-6594701/main/external/libgit2/src/openssl_stream.c(59,35): error G5E568970: incomplete definition of type 'struct bio_st' [/wrkdirs/usr/ports/devel/monodevelop/work/monodevelop-6594701/main/src/addins/VersionControl/MonoDevelop.VersionControl.Git/MonoDevelop.VersionControl.Git.csproj]
  /wrkdirs/usr/ports/devel/monodevelop/work/monodevelop-6594701/main/external/libgit2/src/openssl_stream.c(65,35): error G5E568970: incomplete definition of type 'struct bio_st' [/wrkdirs/usr/ports/devel/monodevelop/work/monodevelop-6594701/main/src/addins/VersionControl/MonoDevelop.VersionControl.Git/MonoDevelop.VersionControl.Git.csproj]
  /wrkdirs/usr/ports/devel/monodevelop/work/monodevelop-6594701/main/external/libgit2/src/openssl_stream.c(94,19): error GB9CE78F2: variable has incomplete type 'BIO_METHOD' (aka 'struct bio_method_st') [/wrkdirs/usr/ports/devel/monodevelop/work/monodevelop-6594701/main/src/addins/VersionControl/MonoDevelop.VersionControl.Git/MonoDevelop.VersionControl.Git.csproj]
  /wrkdirs/usr/ports/devel/monodevelop/work/monodevelop-6594701/main/external/libgit2/src/openssl_stream.c(323,5): error G5E568970: incomplete definition of type 'struct bio_st' [/wrkdirs/usr/ports/devel/monodevelop/work/monodevelop-6594701/main/src/addins/VersionControl/MonoDevelop.VersionControl.Git/MonoDevelop.VersionControl.Git.csproj]
  /wrkdirs/usr/ports/devel/monodevelop/work/monodevelop-6594701/main/src/addins/VersionControl/MonoDevelop.VersionControl.Git/MonoDevelop.VersionControl.Git.csproj(242,5): error MSB3073: The command "bash build_libgit2.sh" exited with code -1.

    180 Warning(s)
    13 Error(s)

Time Elapsed 00:07:59.84
@MonkeyWrench: AddFile: /wrkdirs/usr/ports/devel/monodevelop/work/monodevelop-6594701/main/MonoDevelop.binlog
gmake[2]: *** [Makefile:1124: sln_build] Error 1
gmake[2]: Leaving directory '/wrkdirs/usr/ports/devel/monodevelop/work/monodevelop-6594701/main'
gmake[1]: *** [Makefile:676: all-recursive] Error 1
gmake[1]: Leaving directory '/wrkdirs/usr/ports/devel/monodevelop/work/monodevelop-6594701/main'
*** Error code 1

Stop.
make: stopped in /usr/ports/devel/monodevelop
_______________________________________________
[hidden email] mailing list
https://lists.freebsd.org/mailman/listinfo/freebsd-mono
To unsubscribe, send any mail to "[hidden email]"